{"text_format":"1","workbook":"xlsx","n_sheets":9,"sheets":["RéférenceCDA","SynthèseContrôle","CotationDispositifs","AnalysesComparatives","CVal","ZonesNommées","SeuilsComparaison-EMT","LimitequantificationSDE","ModeOpératoire"],"not_rendered":{"charts":0,"images":0,"macros":1,"external_links":0,"defined_names":86,"comments":0,"pivot_tables":0},"unopened":[],"bounds":{"document_bytes":16777216,"sheet_cells":100000,"rows_first":2000,"rows_last":500,"rows_between":2000,"halvings":0,"cell_chars":16384,"cell_head_chars":4096},"cells_cut":0,"cells_raw":0,"read":"whole","date_system":"1900"}

{"sheet":"RéférenceCDA","index":0,"n_rows":1543,"n_cols":12,"rows_kept":1543,"cut":false,"hidden":true,"merged":[]}
["NOM DE L'ETABLISSEMENT","N° interlocuteur","Point 1","Point 2","Point 3","Point 4","Point 5","Point 6","NumOuvrage","Capacité","Dossier","Numéro Agrément SRR"]
["ABATTOIR DE SISTERON (SISTERON 04)","28146",null,null,null,null,null,null,null,null,"Industrie","SRR-"]
["ABBAYE D'ACEY (VITREUX 39)","17357",null,null,null,null,null,null,null,null,"Industrie","SRR-"]
["ABC (PEYROLLES EN PROVENCE 13)","29664U","Entrée station (SRR)","Sortie station",null,null,null,null,"12369893",null,"Industrie","152-56-569"]
["ABONDANCE GRANGE (74)","74941","Entrée station","Sortie station",null,null,null,null,"0974001002",26000,"Collectivité"]
["ADISSEO (SAINT CLAIR DU RHONE 38)","59401","Rejet usine 1 (SRR)","Eaux refroidi-ssement (SRR)","Rejet usine 2 (SRR)",null,null,null,null,null,"Industrie","98-001"]
["AGDE (34)","34003","Entrée station","Sortie station",null,null,null,null,"0934003001",200000,"Collectivité"]
["AGNIERES EN DEVOLUY (05)","05002",null,null,null,null,null,null,"0905002001",4000,"Collectivité"]
["AHLSTROM LABELPACK (PONT EVEQUE 38)","17042","Entrée station","Sortie station",null,null,null,null,null,null,"Industrie","03-001"]
["AIGUES VIVES (30)","30004",null,null,null,null,null,null,"0930004002",3500,"Collectivité"]
["AILLON LE JEUNE (73)","73004",null,null,null,null,null,null,"0973004001",4000,"Collectivité"]
["AIMARGUES (30)","30006",null,null,null,null,null,null,"0930006002",5000,"Collectivité"]
["AIME LA PLAGNE (73)","73949",null,null,null,null,null,null,"0973006002",36000,"Collectivité"]
["AISEREY (21)","21901",null,null,null,null,null,null,"0921005001",4000,"Collectivité"]
["AIX - LES MILLES VILLAGE (13)","13001",null,null,null,null,null,null,"0913001002",5000,"Collectivité"]
{"$rows_left_out":1529}
{"sheet":"SynthèseContrôle","index":1,"n_rows":27,"n_cols":6,"rows_kept":27,"cut":false,"hidden":false,"merged":[[26,2,26,3],[14,1,14,2],[14,3,14,4],[13,3,13,4],[17,3,17,4],[17,1,17,2],[18,2,18,3],[22,2,22,3],[23,2,23,3],[24,2,24,3],[21,2,21,3],[19,2,19,4],[12,1,12,2],[13,1,13,2],[16,3,16,4],[12,3,12,4],[16,1,16,2],[15,1,15,2],[15,3,15,4],[9,3,9,5],[10,3,10,5],[11,1,11,4],[1,1,3,5],[5,1,5,2],[6,1,6,2],[7,1,7,2],[8,1,8,2],[5,3,5,5],[6,3,6,5],[7,3,7,5],[8,3,8,5],[9,1,9,2],[10,1,10,2]]}
[]
[null,"DIAGNOSTIC DE FONCTIONNEMENT D'UN DISPOSITIF DE SUIVI REGULIER DES REJETS ET DE MESURE DE LA POLLUTION EVITEE PAR UN OUVRAGE DE DEPOLLUTION "]
[]
[]
[]
[null,"Coordonnées de l'établissement : "]
[null,"Code agence de l'eau : "]
[null,"Date ou Numéro d'agrément SRR : "]
[null,"Date d'intervention : "]
[null,"Organisme de contrôle : "]
[null,"Laboratoire(s) de contrôle : "]
[null,"Dénomination des points de suivi régulier des rejets\n et de mesure de la pollution évitée par un ouvrage de dépollution",null,null,null,"SRR"]
[null,"Point 1 : "]
[null,"Point 2 : "]
[null,"Point 3 : "]
{"$rows_left_out":13}
{"sheet":"CotationDispositifs","index":2,"n_rows":39,"n_cols":23,"rows_kept":39,"cut":false,"hidden":false,"merged":[[21,10,23,10],[24,1,24,10],[36,1,36,10],[34,2,34,9],[1,11,1,12],[22,2,22,9],[12,2,12,9],[23,2,23,9],[29,2,29,9],[35,2,35,9],[30,2,30,9],[33,2,33,9],[32,2,32,9],[28,1,28,9],[31,2,31,9],[18,2,18,9],[1,13,1,14],[1,21,1,22],[24,19,24,20],[24,21,24,22],[2,17,2,18],[13,13,13,14],[13,15,13,16],[13,17,13,18],[13,21,13,22],[1,15,1,16],[1,17,1,18],[1,19,1,20],[24,15,24,16],[24,17,24,18],[36,15,36,16],[36,17,36,18],[13,11,13,12],[2,15,2,16],[24,13,24,14],[2,13,2,14],[36,13,36,14],[2,11,2,12],[24,11,24,12],[36,11,36,12],[16,11,16,12],[16,13,16,14],[16,15,16,16],[16,17,16,18],[36,19,36,20],[36,21,36,22],[2,19,2,20],[2,21,2,22],[13,19,13,20],[16,19,16,20],[16,21,16,22],[1,8,2,10],[20,2,20,9],[4,2,4,9],[5,2,5,9],[6,2,6,9],[7,2,7,9],[13,1,13,10],[3,1,3,9],[1,1,2,7],[21,2,21,9],[17,1,17,9],[8,2,8,9],[9,2,9,9],[10,2,10,9],[11,2,11,9],[16,2,16,9],[19,2,19,9]]}
[]
[null,{"$f":"SynthèseContrôle!D6 & \" le\"","v":" le"},null,null,null,null,null,null,{"$f":"SynthèseContrôle!D9","v":"00:00:00"},null,null,{"$f":"IF(SynthèseContrôle!$F$13=\"\",\"Point 1\",\"Point 1 (SRR)\")","v":"Point 1"},null,{"$f":"IF(SynthèseContrôle!$F$14=\"\",\"Point 2\",\"Point 2 (SRR)\")","v":"Point 2"},null,{"$f":"IF(SynthèseContrôle!$F$15=\"\",\"Point 3\",\"Point 3 (SRR)\")","v":"Point 3"},null,{"$f":"IF(SynthèseContrôle!$F$15=\"\",\"Point 4\",\"Point 4 (SRR)\")","v":"Point 4"},null,{"$f":"IF(SynthèseContrôle!$F$17=\"\",\"Point 5\",\"Point 5 (SRR)\")","v":"Point 5"},null,{"$f":"IF(SynthèseContrôle!$F$18=\"\",\"Point 6\",\"Point 6 (SRR)\")","v":"Point 6"}]
[null,null,null,null,null,null,null,null,null,null,null,{"$f":"IF(ISBLANK(SynthèseContrôle!$D$13),\"\",SynthèseContrôle!$D$13)","v":""},null,{"$f":"IF(ISBLANK(SynthèseContrôle!$D$14),\"\",SynthèseContrôle!$D$14)","v":""},null,{"$f":"IF(ISBLANK(SynthèseContrôle!$D$15),\"\",SynthèseContrôle!$D$15)","v":""},null,{"$f":"IF(ISBLANK(SynthèseContrôle!$D$16),\"\",SynthèseContrôle!$D$16)","v":""},null,{"$f":"IF(ISBLANK(SynthèseContrôle!$D$17),\"\",SynthèseContrôle!$D$17)","v":""},null,{"$f":"IF(ISBLANK(SynthèseContrôle!$D$18),\"\",SynthèseContrôle!$D$18)","v":""}]
[null,"Mesure de débit en écoulement à surface libre",null,null,null,null,null,null,null,null,"Coef.","Oui","Non","Oui","Non","Oui","Non","Oui","Non","Oui","Non","Oui","Non"]
[null,1,"Le dimensionnement de l'organe de mesure vis-à-vis de l'étendue des débits à mesurer, y compris celui des canaux d'approche et de fuite, sont-ils conformes aux normes en vigueur et/ou aux prescriptions des constructeurs ?",null,null,null,null,null,null,null,5]
[null,2,"La planéité et l'horizontalité de l'organe de mesure, y compris pour les canaux d'approche et de fuite, sont-elles conformes aux normes en vigueur et/ou aux prescriptions des constructeurs ?",null,null,null,null,null,null,null,5]
[null,3,"L'étanchéité, la propreté et l'état d'entretien de l'organe de mesure, y compris ceux des canaux d'approche et de fuite, sont-ils satisfaisants ?",null,null,null,null,null,null,null,1]
[null,4,"Le fonctionnement hydraulique de l'organe de mesure, en amont et en aval, est-il satisfaisant ?",null,null,null,null,null,null,null,5]
[null,5,"Le capteur de mesure est-il adapté au type d'effluent et à l'environnement rencontrés (mousses, température, etc..) et présente t-il un état de propreté satisfaisant ?",null,null,null,null,null,null,null,2]
[null,6,"L'implantation du capteur respecte t-elle les normes en vigueur et/ou les prescriptions des constructeurs ? ",null,null,null,null,null,null,null,1]
[null,7,"Existe t-il un système de contrôle adapté de la hauteur d'eau et/ou du débit ?",null,null,null,null,null,null,null,1]
[null,8,"La loi hydraulique Q = f (h) utilisée, est-elle cohérente avec les caractéristiques de l'organe de mesure ?",null,null,null,null,null,null,null,5]
[null,9,"L'écart (*) entre d'une part les résultats de mesures obtenus à partir des dispositifs en place et ceux mesurés par l'organisme de contrôle d'autre part est-il :\n     ≤ à 10% pour un volume mesuré ≤ à 50 m3 ?\n     ≤ à 5% pour un volume mesuré > à 50 m3 par un organe calibré ?\nPour les débits < 10 m3, le fonctionnement sera alors apprécié par l'opérateur.",null,null,null,null,null,null,null,10]
[null,"Résultat de la cotation sur 10 è",null,null,null,null,null,null,null,null,null,{"$f":"IF(AND(ISNA(LOOKUP(\"X\",L5:L13)),ISNA(LOOKUP(\"X\",M5:M13))),\"\",SUMPRODUCT((L5:L13=\"X\")*($K$5:$K$13))/3.5)","v":""},null,{"$f":"IF(AND(ISNA(LOOKUP(\"X\",N5:N13)),ISNA(LOOKUP(\"X\",O5:O13))),\"\",SUMPRODUCT((N5:N13=\"X\")*($K$5:$K$13))/3.5)","v":""},null,{"$f":"IF(AND(ISNA(LOOKUP(\"X\",P5:P13)),ISNA(LOOKUP(\"X\",Q5:Q13))),\"\",SUMPRODUCT((P5:P13=\"X\")*($K$5:$K$13))/3.5)","v":""},null,{"$f":"IF(AND(ISNA(LOOKUP(\"X\",R5:R13)),ISNA(LOOKUP(\"X\",S5:S13))),\"\",SUMPRODUCT((R5:R13=\"X\")*($K$5:$K$13))/3.5)","v":""},null,{"$f":"IF(AND(ISNA(LOOKUP(\"X\",T5:T13)),ISNA(LOOKUP(\"X\",U5:U13))),\"\",SUMPRODUCT((T5:T13=\"X\")*($K$5:$K$13))/3.5)","v":""},null,{"$f":"IF(AND(ISNA(LOOKUP(\"X\",V5:V13)),ISNA(LOOKUP(\"X\",W5:W13))),\"\",SUMPRODUCT((V5:V13=\"X\")*($K$5:$K$13))/3.5)","v":""}]
[]
{"$rows_left_out":25}
{"sheet":"AnalysesComparatives","index":3,"n_rows":84,"n_cols":20,"rows_kept":84,"cut":false,"hidden":false,"merged":[[9,16,9,17],[18,16,18,17],[19,16,20,17],[24,16,24,17],[1,1,1,19],[2,8,2,19],[3,8,3,19],[5,1,5,15],[18,1,18,15],[2,1,2,7],[3,1,3,7],[5,16,5,17],[6,16,6,17],[7,16,7,17],[8,16,8,17],[55,14,55,19],[55,2,55,7],[55,8,55,13],[26,2,26,7],[26,8,26,13],[26,14,26,19]]}
[]
[null,"COMPARATIF ANALYTIQUE"]
[null,"Les analyses de l'établissement sont réalisées par :"]
[null,"Les analyses de contrôle ont été réalisées par :",null,null,null,null,null,null,{"$f":"SynthèseContrôle!D11","v":0}]
[]
[null,"Les échantillons sont-ils constitués, conservés et mis en analyse, selon les règles de l'art en vigueur ?",null,null,null,null,null,null,null,null,null,null,null,null,null,null,"Pénalité (5)"]
[null,null,null,null,null,null,null,null,null,null,null,null,"Le guide AQUAREF est-il respecté pour le prélèvement des échantillons SDE (1) ?",null,"Non Concerné",null,{"$f":"IF(O7=\"\",\"\",IF(O7=\"Non\",0.1,0))","v":0}]
[null,null,null,null,null,null,null,null,null,null,null,null,"Les échantillons sont-ils fractionnés sous agitation mécanique (2) ?",null,"MES<60mg/L",null,{"$f":"IF(O8=\"\",\"\",IF(O8=\"Non\",0.1,0))","v":0}]
[null,null,null,null,null,null,null,null,null,null,null,null,"La conservation et le transport des échantillons est-il assuré à 5°C ±3 (3) ?",null,"Oui",null,0]
[null,null,null,null,null,null,null,null,null,null,null,null,"Les analyses sont-elles mises en œuvre sous 24 h (4) ?",null,"Oui",null,0]
[]
[null,null,null,"(1) Tuyau d'aspiration en téflon et bocaux en verre"]
[null,null,null,"(2) Tolérance pour les points de rejet industriels si la concentration en MES est inférieure à 60 mg/l"]
[null,null,null,"(3) Regarder les conditions de stockage et les bulletins d'analyses"]
[null,null,null,"(3) Regarder les conditions de stockage sur site et la température des enceintes de stockage notée sur les bulletins d'analyses"]
{"$rows_left_out":70}
{"sheet":"CVal","index":4,"n_rows":63,"n_cols":13,"rows_kept":63,"cut":false,"hidden":true,"merged":[[37,1,37,4],[37,9,37,12],[36,0,36,12],[2,2,2,4],[9,1,9,4],[9,9,9,12],[8,0,8,12],[9,5,9,8],[0,0,0,12],[3,11,3,12],[4,11,4,12],[3,0,3,2],[4,0,4,2]]}
["ETAT COMPARATIF ANALYTIQUE"]
[]
[null,"Contrôle effectué le","2003-06-25"]
["Organisme(s) de contrôle",null,null,"GUIGUES",null,null,null,null,null,null,"Date de réception des résultats d'analyses","2003-07-02"]
["Analyses station réalisées par",null,null,"Labo SEM",null,null,null,null,null,null,"Ecarts entre Date Analyses/Réception",{"$f":"L4-C3","v":7}]
[]
[]
[]
["Dénomination des points d'autosurveillance"]
[null,"Rejet COURLY",null,null,null,"REJET UF",null,null,null,"Envoi GEPEIF"]
["paramètres","Station\nOU Etabliss","Labo\n de contrôle.","Ecart","Conformité","Station\nOU Etabliss","Labo\n de contrôle.","Ecart","Conformité","Station\nOU Etabliss","Labo\n de contrôle.","Ecart","Conformité"]
["DBO5",{"$f":"IF(ISBLANK(AnalysesComparatives!C29),\"\",SUBSTITUTE(AnalysesComparatives!C29,\"<\",\"\")*1)","v":""},{"$f":"IF(ISBLANK(AnalysesComparatives!E29),\"\",SUBSTITUTE(AnalysesComparatives!E29,\"<\",\"\")*1)","v":""},{"$f":"IF(OR(C12=\"\",B12=\"\"),\"\",IF(AND(B12<=SC_DBO5,C12<=SC_DBO5),\"-\",(B12-AVERAGE(B12:C12))/AVERAGE(B12:C12)))","v":""},{"$f":"IF(D12=\"\",\"\",IF(D12=\"-\",\"oui\",IF(OR(AND(AVERAGE(B12:C12)>DBO5faible,ABS(D12)>3*EMT_DBO5_forte),AND(AVERAGE(B12:C12)<DBO5faible,ABS(D12)>3*EMT_DBO5_faible)),\"non\",IF(AND(B12<=SC_DBO5,C12<=SC_DBO5),\"oui\",IF(AND(AVERAGE(B12:C12)>DBO5faible,D12>=-EMT_DBO5_forte,D12<=EMT_DBO5_forte),\"oui\",IF(AND(AVERAGE(B12:C12)<=DBO5faible,D12>=-EMT_DBO5_faible,D12<=EMT_DBO5_faible),\"oui\",\"non\"))))))","v":""},{"$f":"IF(ISBLANK(AnalysesComparatives!I29),\"\",SUBSTITUTE(AnalysesComparatives!I29,\"<\",\"\")*1)","v":""},{"$f":"IF(ISBLANK(AnalysesComparatives!J29),\"\",SUBSTITUTE(AnalysesComparatives!J29,\"<\",\"\")*1)","v":""},{"$f":"IF(OR(G12=\"\",F12=\"\"),\"\",IF(AND(F12<=SC_DBO5,G12<=SC_DBO5),\"-\",(F12-AVERAGE(F12:G12))/AVERAGE(F12:G12)))","v":""},{"$f":"IF(H12=\"\",\"\",IF(H12=\"-\",\"oui\",IF(OR(AND(AVERAGE(F12:G12)>DBO5faible,ABS(H12)>3*EMT_DBO5_forte),AND(AVERAGE(F12:G12)<DBO5faible,ABS(H12)>3*EMT_DBO5_faible)),\"non\",IF(AND(F12<=SC_DBO5,G12<=SC_DBO5),\"oui\",IF(AND(AVERAGE(F12:G12)>DBO5faible,H12>=-EMT_DBO5_forte,H12<=EMT_DBO5_forte),\"oui\",IF(AND(AVERAGE(F12:G12)<=DBO5faible,H12>=-EMT_DBO5_faible,H12<=EMT_DBO5_faible),\"oui\",\"non\"))))))","v":""},{"$f":"IF(ISBLANK(AnalysesComparatives!M29),\"\",SUBSTITUTE(AnalysesComparatives!M29,\"<\",\"\")*1)","v":{"$error":"#VALUE!"}},{"$f":"IF(ISBLANK(AnalysesComparatives!N29),\"\",SUBSTITUTE(AnalysesComparatives!N29,\"<\",\"\")*1)","v":{"$error":"#VALUE!"}},{"$f":"IF(OR(K12=\"\",J12=\"\"),\"\",IF(AND(J12<=SC_DBO5,K12<=SC_DBO5),\"-\",(J12-AVERAGE(J12:K12))/AVERAGE(J12:K12)))","v":{"$error":"#VALUE!"}},{"$f":"IF(L12=\"\",\"\",IF(L12=\"-\",\"oui\",IF(OR(AND(AVERAGE(J12:K12)>DBO5faible,ABS(L12)>3*EMT_DBO5_forte),AND(AVERAGE(J12:K12)<DBO5faible,ABS(L12)>3*EMT_DBO5_faible)),\"non\",IF(AND(J12<=SC_DBO5,K12<=SC_DBO5),\"oui\",IF(AND(AVERAGE(J12:K12)>DBO5faible,L12>=-EMT_DBO5_forte,L12<=EMT_DBO5_forte),\"oui\",IF(AND(AVERAGE(J12:K12)<=DBO5faible,L12>=-EMT_DBO5_faible,L12<=EMT_DBO5_faible),\"oui\",\"non\"))))))","v":{"$error":"#VALUE!"}}]
["DCO",{"$f":"IF(ISBLANK(AnalysesComparatives!C31),\"\",SUBSTITUTE(AnalysesComparatives!C31,\"<\",\"\")*1)","v":""},{"$f":"IF(ISBLANK(AnalysesComparatives!E31),\"\",SUBSTITUTE(AnalysesComparatives!E31,\"<\",\"\")*1)","v":""},{"$f":"IF(OR(C13=\"\",B13=\"\"),\"\",IF(AND(B13<=SC_DCO,C13<=SC_DCO),\"-\",(B13-AVERAGE(B13:C13))/AVERAGE(B13:C13)))","v":""},{"$f":"IF(D13=\"\",\"\",IF(D13=\"-\",\"oui\",IF(OR(AND(AVERAGE(B13:C13)>DCOfaible,ABS(D13)>3*EMT_DCO_forte),AND(AVERAGE(B13:C13)<DCOfaible,ABS(D13)>3*EMT_DCO_faible)),\"non\",IF(AND(B13<=SC_DCO,C13<=SC_DCO),\"oui\",IF(AND(AVERAGE(B13:C13)>DCOfaible,D13>=-EMT_DCO_forte,D13<=EMT_DCO_forte),\"oui\",IF(AND(AVERAGE(B13:C13)<=DCOfaible,D13>=-EMT_DCO_faible,D13<=EMT_DCO_faible),\"oui\",\"non\"))))))","v":""},{"$f":"IF(ISBLANK(AnalysesComparatives!I31),\"\",SUBSTITUTE(AnalysesComparatives!I31,\"<\",\"\")*1)","v":""},{"$f":"IF(ISBLANK(AnalysesComparatives!J31),\"\",SUBSTITUTE(AnalysesComparatives!J31,\"<\",\"\")*1)","v":""},{"$f":"IF(OR(G13=\"\",F13=\"\"),\"\",IF(AND(F13<=SC_DCO,G13<=SC_DCO),\"-\",(F13-AVERAGE(F13:G13))/AVERAGE(F13:G13)))","v":""},{"$f":"IF(H13=\"\",\"\",IF(H13=\"-\",\"oui\",IF(OR(AND(AVERAGE(F13:G13)>DCOfaible,ABS(H13)>3*EMT_DCO_forte),AND(AVERAGE(F13:G13)<DCOfaible,ABS(H13)>3*EMT_DCO_faible)),\"non\",IF(AND(F13<=SC_DCO,G13<=SC_DCO),\"oui\",IF(AND(AVERAGE(F13:G13)>DCOfaible,H13>=-EMT_DCO_forte,H13<=EMT_DCO_forte),\"oui\",IF(AND(AVERAGE(F13:G13)<=DCOfaible,H13>=-EMT_DCO_faible,H13<=EMT_DCO_faible),\"oui\",\"non\"))))))","v":""},{"$f":"IF(ISBLANK(AnalysesComparatives!M31),\"\",SUBSTITUTE(AnalysesComparatives!M31,\"<\",\"\")*1)","v":{"$error":"#VALUE!"}},{"$f":"IF(ISBLANK(AnalysesComparatives!N31),\"\",SUBSTITUTE(AnalysesComparatives!N31,\"<\",\"\")*1)","v":{"$error":"#VALUE!"}},{"$f":"IF(OR(K13=\"\",J13=\"\"),\"\",IF(AND(J13<=SC_DCO,K13<=SC_DCO),\"-\",(J13-AVERAGE(J13:K13))/AVERAGE(J13:K13)))","v":{"$error":"#VALUE!"}},{"$f":"IF(L13=\"\",\"\",IF(L13=\"-\",\"oui\",IF(OR(AND(AVERAGE(J13:K13)>DCOfaible,ABS(L13)>3*EMT_DCO_forte),AND(AVERAGE(J13:K13)<DCOfaible,ABS(L13)>3*EMT_DCO_faible)),\"non\",IF(AND(J13<=SC_DCO,K13<=SC_DCO),\"oui\",IF(AND(AVERAGE(J13:K13)>DCOfaible,L13>=-EMT_DCO_forte,L13<=EMT_DCO_forte),\"oui\",IF(AND(AVERAGE(J13:K13)<=DCOfaible,L13>=-EMT_DCO_faible,L13<=EMT_DCO_faible),\"oui\",\"non\"))))))","v":{"$error":"#VALUE!"}}]
["MES",{"$f":"IF(ISBLANK(AnalysesComparatives!C33),\"\",SUBSTITUTE(AnalysesComparatives!C33,\"<\",\"\")*1)","v":""},{"$f":"IF(ISBLANK(AnalysesComparatives!E33),\"\",SUBSTITUTE(AnalysesComparatives!E33,\"<\",\"\")*1)","v":""},{"$f":"IF(OR(C14=\"\",B14=\"\"),\"\",IF(AND(B14<=SC_MEST,C14<=SC_MEST),\"-\",(B14-AVERAGE(B14:C14))/AVERAGE(B14:C14)))","v":""},{"$f":"IF(D14=\"\",\"\",IF(D14=\"-\",\"oui\",IF(OR(AND(AVERAGE(B14:C14)>MESTfaible,ABS(D14)>3*EMT_MEST_forte),AND(AVERAGE(B14:C14)<MESTfaible,ABS(D14)>3*EMT_MEST_faible)),\"non\",IF(AND(B14<=SC_MEST,C14<=SC_MEST),\"oui\",IF(AND(AVERAGE(B14:C14)>MESTfaible,D14>=-EMT_MEST_forte,D14<=EMT_MEST_forte),\"oui\",IF(AND(AVERAGE(B14:C14)<=MESTfaible,D14>=-EMT_MEST_faible,D14<=EMT_MEST_faible),\"oui\",\"non\"))))))","v":""},{"$f":"IF(ISBLANK(AnalysesComparatives!I33),\"\",SUBSTITUTE(AnalysesComparatives!I33,\"<\",\"\")*1)","v":""},{"$f":"IF(ISBLANK(AnalysesComparatives!J33),\"\",SUBSTITUTE(AnalysesComparatives!J33,\"<\",\"\")*1)","v":""},{"$f":"IF(OR(G14=\"\",F14=\"\"),\"\",IF(AND(F14<=SC_MEST,G14<=SC_MEST),\"-\",(F14-AVERAGE(F14:G14))/AVERAGE(F14:G14)))","v":""},{"$f":"IF(H14=\"\",\"\",IF(H14=\"-\",\"oui\",IF(OR(AND(AVERAGE(F14:G14)>MESTfaible,ABS(H14)>3*EMT_MEST_forte),AND(AVERAGE(F14:G14)<MESTfaible,ABS(H14)>3*EMT_MEST_faible)),\"non\",IF(AND(F14<=SC_MEST,G14<=SC_MEST),\"oui\",IF(AND(AVERAGE(F14:G14)>MESTfaible,H14>=-EMT_MEST_forte,H14<=EMT_MEST_forte),\"oui\",IF(AND(AVERAGE(F14:G14)<=MESTfaible,H14>=-EMT_MEST_faible,H14<=EMT_MEST_faible),\"oui\",\"non\"))))))","v":""},{"$f":"IF(ISBLANK(AnalysesComparatives!M33),\"\",SUBSTITUTE(AnalysesComparatives!M33,\"<\",\"\")*1)","v":{"$error":"#VALUE!"}},{"$f":"IF(ISBLANK(AnalysesComparatives!N33),\"\",SUBSTITUTE(AnalysesComparatives!N33,\"<\",\"\")*1)","v":{"$error":"#VALUE!"}},{"$f":"IF(OR(K14=\"\",J14=\"\"),\"\",IF(AND(J14<=SC_MEST,K14<=SC_MEST),\"-\",(J14-AVERAGE(J14:K14))/AVERAGE(J14:K14)))","v":{"$error":"#VALUE!"}},{"$f":"IF(L14=\"\",\"\",IF(L14=\"-\",\"oui\",IF(OR(AND(AVERAGE(J14:K14)>MESTfaible,ABS(L14)>3*EMT_MEST_forte),AND(AVERAGE(J14:K14)<MESTfaible,ABS(L14)>3*EMT_MEST_faible)),\"non\",IF(AND(J14<=SC_MEST,K14<=SC_MEST),\"oui\",IF(AND(AVERAGE(J14:K14)>MESTfaible,L14>=-EMT_MEST_forte,L14<=EMT_MEST_forte),\"oui\",IF(AND(AVERAGE(J14:K14)<=MESTfaible,L14>=-EMT_MEST_faible,L14<=EMT_MEST_faible),\"oui\",\"non\"))))))","v":{"$error":"#VALUE!"}}]
["Nk",{"$f":"IF(ISBLANK(AnalysesComparatives!C34),\"\",SUBSTITUTE(AnalysesComparatives!C34,\"<\",\"\")*1)","v":""},{"$f":"IF(ISBLANK(AnalysesComparatives!E34),\"\",SUBSTITUTE(AnalysesComparatives!E34,\"<\",\"\")*1)","v":""},{"$f":"IF(OR(C15=\"\",B15=\"\"),\"\",IF(AND(B15<=SC_Nk,C15<=SC_Nk),\"-\",(B15-AVERAGE(B15:C15))/AVERAGE(B15:C15)))","v":""},{"$f":"IF(D15=\"\",\"\",IF(D15=\"-\",\"oui\",IF(OR(AND(AVERAGE(B15:C15)>Nkfaible,ABS(D15)>3*EMT_Nk_forte),AND(AVERAGE(B15:C15)<Nkfaible,ABS(D15)>3*EMT_Nk_faible)),\"non\",IF(AND(B15<=SC_Nk,C15<=SC_Nk),\"non\",IF(AND(AVERAGE(B15:C15)>Nkfaible,D15>=-EMT_Nk_forte,D15<=EMT_Nk_forte),\"oui\",IF(AND(AVERAGE(B15:C15)<=Nkfaible,D15>=-EMT_Nk_faible,D15<=EMT_Nk_faible),\"oui\",\"non\"))))))","v":""},{"$f":"IF(ISBLANK(AnalysesComparatives!I34),\"\",SUBSTITUTE(AnalysesComparatives!I34,\"<\",\"\")*1)","v":""},{"$f":"IF(ISBLANK(AnalysesComparatives!J34),\"\",SUBSTITUTE(AnalysesComparatives!J34,\"<\",\"\")*1)","v":""},{"$f":"IF(OR(G15=\"\",F15=\"\"),\"\",IF(AND(F15<=SC_Nk,G15<=SC_Nk),\"-\",(F15-AVERAGE(F15:G15))/AVERAGE(F15:G15)))","v":""},{"$f":"IF(H15=\"\",\"\",IF(H15=\"-\",\"oui\",IF(OR(AND(AVERAGE(F15:G15)>Nkfaible,ABS(H15)>3*EMT_Nk_forte),AND(AVERAGE(F15:G15)<Nkfaible,ABS(H15)>3*EMT_Nk_faible)),\"non\",IF(AND(F15<=SC_Nk,G15<=SC_Nk),\"non\",IF(AND(AVERAGE(F15:G15)>Nkfaible,H15>=-EMT_Nk_forte,H15<=EMT_Nk_forte),\"oui\",IF(AND(AVERAGE(F15:G15)<=Nkfaible,H15>=-EMT_Nk_faible,H15<=EMT_Nk_faible),\"oui\",\"non\"))))))","v":""},{"$f":"IF(ISBLANK(AnalysesComparatives!M34),\"\",SUBSTITUTE(AnalysesComparatives!M34,\"<\",\"\")*1)","v":{"$error":"#VALUE!"}},{"$f":"IF(ISBLANK(AnalysesComparatives!N34),\"\",SUBSTITUTE(AnalysesComparatives!N34,\"<\",\"\")*1)","v":{"$error":"#VALUE!"}},{"$f":"IF(OR(K15=\"\",J15=\"\"),\"\",IF(AND(J15<=SC_Nk,K15<=SC_Nk),\"-\",(J15-AVERAGE(J15:K15))/AVERAGE(J15:K15)))","v":{"$error":"#VALUE!"}},{"$f":"IF(L15=\"\",\"\",IF(L15=\"-\",\"oui\",IF(OR(AND(AVERAGE(J15:K15)>Nkfaible,ABS(L15)>3*EMT_Nk_forte),AND(AVERAGE(J15:K15)<Nkfaible,ABS(L15)>3*EMT_Nk_faible)),\"non\",IF(AND(J15<=SC_Nk,K15<=SC_Nk),\"non\",IF(AND(AVERAGE(J15:K15)>Nkfaible,L15>=-EMT_Nk_forte,L15<=EMT_Nk_forte),\"oui\",IF(AND(AVERAGE(J15:K15)<=Nkfaible,L15>=-EMT_Nk_faible,L15<=EMT_Nk_faible),\"oui\",\"non\"))))))","v":{"$error":"#VALUE!"}}]
{"$rows_left_out":49}
{"sheet":"ZonesNommées","index":5,"n_rows":65,"n_cols":10,"rows_kept":65,"cut":false,"hidden":true,"merged":[[0,1,0,2]]}
[null,"Zones nommées",null,null,"IndexStation","Type Point","Intervenants","Laboratoires","Paramètres","SRR"]
[null,"SC DBO5",15,{"$f":"SynthèseContrôle!D6","v":0},{"$f":"MATCH(SynthèseContrôle!D6,RéférenceCDA!A2:A1945)","v":{"$error":"#N/A"}},"Entrée station","Agence de l'Eau RM&C","APAVE SUD","AOX","X"]
[null,"DBO5faible",80,null,null,"Sortie station","CETE Apave Sud Europe - Marseille","CAR ILLKIRCH","MI"]
[null,"EMT DBO5 faible",0.3,null,null,"Eaux refroidi-ssement","CETE Apave Sud Europe - Tassin","SEM","TEMPERATURE"]
[null,"EMT DBO5 forte",0.2,null,null,"Sortie prétraitement","APAVE Alsacienne","LSEH"]
[null,"SC DCO",80,null,null,"Rejet général","CEREG Ingéniérie","LSEH MI"]
[null,"DCOfaible",250,null,null,"Rejet usine","CTC","SEM MI"]
[null,"EMT DCO faible",0.2,null,null,"Entrée tampon","JCM Environnement","APAVE SUD & SEM MI"]
[null,"EMT DCO forte",0.1,null,null,"Sortie tampon","IRH Ingénieur Conseil","SEM & SEM MI"]
[null,"SC ST-DCO",20,null,null,"By-pass","NORISKO Equipements - Vitrolles","LSEH & LSEH MI"]
[null,"ST-DCOfaible",150,null,null,"Déversoir","SATESE - Office d'Equipement Hydraulique de la Corse","CAR ILLKIRCH & LSEH MI"]
[null,"EMT ST-DCO faible",0.2,null,null,"Eau alimentation","SGS - Vaulx en Velin","LDVH DE LA HAUTE SAONE"]
[null,"EMT ST-DCO forte",0.1,null,null,"Sortie biologique","SOCOTEC Industries"]
[null,"SC MEST",15,null,null,"Sortie physico","SATESE - Conseil Départemental des Alpes Maritimes"]
[null,"MESTfaible",60,null,null,"Boues aérées","SATESE - Conseil Départemental de la Savoie"]
{"$rows_left_out":51}
{"sheet":"SeuilsComparaison-EMT","index":6,"n_rows":26,"n_cols":10,"rows_kept":26,"cut":false,"hidden":false,"merged":[[34,3,44,8],[1,1,1,9],[25,1,26,9]]}
[]
[null," COMPARATIF ANALYTIQUE : DEFINITION DES ECARTS MAXIMUM TOLERES (EMT)"]
[]
[null,"Code SANDRE","Paramètres","Unités","Limites de quantification","Seuil de comparaison","Concentration supérieure au seuil de comparaison et   inférieure ou égale à","Ecart Maximum Toléré","Concentration supérieure à","Ecart Maximum Toléré"]
[null,1313,"DBO5","en mg/l de O2",3,15,80,0.3,80,0.2]
[null,1314,"DCO","en mg/l de O2",30,80,250,0.2,250,0.1]
[null,6396,"ST DCO","en mg/l de O2",10,20,150,0.2,150,0.1]
[null,1305,"MEST","en mg/l",2,15,60,0.3,60,0.2]
[null,1319,"NKJ (N)","en mg/l de N",0.5,6,null,null,6,0.1]
[null,1551,"NGL","en mg/l de N",1,6,null,null,6,0.2]
[null,1335,"NH4 (NH4)","en mg/l de NH4+",0.5,6,null,null,6,0.1]
[null,1339,"NO2 (NO2)","en mg/l de NO2",0.05,1,null,null,1,0.2]
[null,1340,"NO3 (NO3)","en mg/l de NO3",1,5,null,null,5,0.2]
[null,1350,"PT","en mg/l de P",0.05,1,null,null,1,0.2]
[null,1369,"As","en mg/l",5.0000000000000001E-3,0.5,1,0.6,1,0.3]
{"$rows_left_out":12}
{"sheet":"LimitequantificationSDE","index":7,"n_rows":20,"n_cols":5,"rows_kept":20,"cut":false,"hidden":false,"merged":[[1,1,1,4]]}
[]
[null," LIMITES DE QUANTIFICATION POUR LES SDE"]
[]
[null,"Code SANDRE","Paramètres","Limites de quantification","Coefficient multiplicateur de la masse rejetée"]
[null,1458,"Anthracène","0,010 µg/l",100]
[null,1114,"Benzène","1,0 µg/l",10]
[null,1115,"Benzo(a)pyrène","0,010 µg/l",100]
[null,1116,"Benzo(b)fluoranthène","0,005 µg/l",100]
[null,1117,"Benzo(k)fluoranthène","0,005 µg/l",100]
[null,1118,"Benzo(ghi)pérylène","0,005 µg/l",1000]
[null,6616,"Di(2-éthylhexyl)phtalate DEHP","1,0 µg/l",10]
[null,1497,"Ethylbenzène","1,0 µg/l",10]
[null,1191,"Fluoranthène","0,010 µg/l",100]
[null,1204,"Indeno(1,2,3-cd)pyrène","0,005 µg/l",1000]
[null,1517,"Naphtalène","0,050 µg/l",10]
{"$rows_left_out":6}
{"sheet":"ModeOpératoire","index":8,"n_rows":35,"n_cols":1,"rows_kept":35,"cut":false,"hidden":false,"merged":[]}
["Mode opératoire d’utilisation de la fiche de cotation du fonctionnement du dispositif de suivi régulier des rejets et de mesure de la pollution évitée"]
[]
[]
["Onglet  cotation dispositif :"]
["Pour les rubriques \"Mesure de débit et Prélèvement\", l’évaluation de chaque critère s’effectue par un double « clic » sur la case oui ou non, tous les critères doivent être évalués,"]
["Pour la mesure de débit en écoulement en charge, le bon fonctionnement sera évalué à partir d’une mesure comparative et (si écart entre 5 et 10%) / ou (si impossibilité d'une mesure) à partir des 3 méthodes alternatives."]
[]
["Onglet  analyses comparatives :"]
["Evaluer la qualité du traitement des échantillons : choisir « oui » ou « non », sur les bases des critères d’évaluations présentés,"]
["Renseigner pour chaque paramètre analytique considéré, les cases correspondantes aux résultats d’analyses produits par le laboratoire de l’établissement et le(s) laboratoire(s) de contrôle,"]
["Identifier en jaune les résultats d'analyses produits par le laboratoire de l'établissement interne."]
["Identifier en italique les résultats d'analyses produits sous accréditation ou agrément"]
[]
["Méthode de calcul des écarts : mesure de débit ou analyses"]
["Soit a, le résultat de mesure ou d’analyse produit par  l'établissement"]
{"$rows_left_out":20}