{"text_format":"1","workbook":"xlsx","n_sheets":9,"sheets":["RéférenceCDA","SynthèseContrôle","CotationDispositifs","AnalysesComparatives","CVal","ZonesNommées","SeuilsComparaison-EMT","LimitequantificationSDE","ModeOpératoire"],"not_rendered":{"charts":0,"images":0,"macros":1,"external_links":0,"defined_names":86,"comments":0,"pivot_tables":0},"unopened":[],"bounds":{"document_bytes":16777216,"sheet_cells":100000,"rows_first":2000,"rows_last":500,"rows_between":2000,"halvings":0,"cell_chars":16384,"cell_head_chars":4096},"cells_cut":0,"cells_raw":0,"read":"whole","date_system":"1900"}

{"sheet":"RéférenceCDA","index":0,"n_rows":1543,"n_cols":12,"rows_kept":1543,"cut":false,"hidden":true,"merged":[]}
["NOM DE L'ETABLISSEMENT","N° interlocuteur","Point 1","Point 2","Point 3","Point 4","Point 5","Point 6","NumOuvrage","Capacité","Dossier","Numéro Agrément SRR"]
["ABATTOIR DE SISTERON (SISTERON 04)","28146",null,null,null,null,null,null,null,null,"Industrie","SRR-"]
["ABBAYE D'ACEY (VITREUX 39)","17357",null,null,null,null,null,null,null,null,"Industrie","SRR-"]
["ABC (PEYROLLES EN PROVENCE 13)","29664U","Entrée station (SRR)","Sortie station",null,null,null,null,"12369893",null,"Industrie","152-56-569"]
["ABONDANCE GRANGE (74)","74941","Entrée station","Sortie station",null,null,null,null,"0974001002",26000,"Collectivité"]
["ADISSEO (SAINT CLAIR DU RHONE 38)","59401","Rejet usine 1 (SRR)","Eaux refroidi-ssement (SRR)","Rejet usine 2 (SRR)",null,null,null,null,null,"Industrie","98-001"]
["AGDE (34)","34003","Entrée station","Sortie station",null,null,null,null,"0934003001",200000,"Collectivité"]
["AGNIERES EN DEVOLUY (05)","05002",null,null,null,null,null,null,"0905002001",4000,"Collectivité"]
["AHLSTROM LABELPACK (PONT EVEQUE 38)","17042","Entrée station","Sortie station",null,null,null,null,null,null,"Industrie","03-001"]
["AIGUES VIVES (30)","30004",null,null,null,null,null,null,"0930004002",3500,"Collectivité"]
["AILLON LE JEUNE (73)","73004",null,null,null,null,null,null,"0973004001",4000,"Collectivité"]
["AIMARGUES (30)","30006",null,null,null,null,null,null,"0930006002",5000,"Collectivité"]
["AIME LA PLAGNE (73)","73949",null,null,null,null,null,null,"0973006002",36000,"Collectivité"]
["AISEREY (21)","21901",null,null,null,null,null,null,"0921005001",4000,"Collectivité"]
["AIX - LES MILLES VILLAGE (13)","13001",null,null,null,null,null,null,"0913001002",5000,"Collectivité"]
["AIX EN PROVENCE - LA PIOLINE (13)","13001","Entrée 1","Entrée 2","Sortie station","By-pass 1","By-pass 2",null,"0913001001",175000,"Collectivité"]
["AIX EN PROVENCE - ZI LES MILLES (13)","13001","Sortie station","Sortie station","By-pass",null,null,null,"0913001005",5000,"Collectivité"]
["AIX LES BAINS (73)","73925","Entrée station","Sortie station","By-pass",null,null,null,"0973008001",75000,"Collectivité"]
["AJACCIO (2A)","20933","Entrée station","Sortie station",null,null,null,null,"0920004001",73000,"Collectivité"]
["ALBENS (73)","73980",null,null,null,null,null,null,"0973010001",3000,"Collectivité"]
["ALBY SUR CHERAN SAINT SYLVESTRE (74)","74971",null,null,null,null,null,null,"0974002004",5000,"Collectivité"]
["ALES (30)","30810","Entrée station","Sortie 1","Sortie 2",null,null,null,"0930259003",90000,"Collectivité"]
["ALFA D'AVIGNON","29256",null,null,null,null,null,null,null,null,"Industrie"]
["ALLEGRE LES FUMADES (30)","30008",null,null,null,null,null,null,"0930008002",2500,"Collectivité"]
["ALLEINS (13)","13940",null,null,null,null,null,null,"0913003002",2500,"Collectivité"]
["ALLEX - GRANE (26)","26994","Entrée station","Sortie station",null,null,null,null,"0926006001",10000,"Collectivité"]
["ALLONZIER LA CAILLE (74)","74905",null,null,null,null,null,null,"0974006001",7500,"Collectivité"]
["ALLOS (04)","04006",null,null,null,null,null,null,"0904006003",20000,"Collectivité"]
["ALMECO (SATMA) (GONCELIN 38)","16909",null,null,null,null,null,null,null,null,"Industrie","SRR-08003"]
["ALSTOM T&D SA (MACON 71)",null,"Sortie station",null,null,null,null,null,null,null,"Industrie","20-231-458"]
["ALTHEN DES PALUDS (84)","84903",null,null,null,null,null,null,"0984001001",2100,"Collectivité"]
["ALUMINIUM PECHINEY (GARDANNE 13)",null,null,null,null,null,null,null,null,null,"Industrie"]
["ALVIMEDITERANNEE (VITROLLES 13 )","40671H","Entrée station","Sortie station",null,null,null,null,null,null,"Industrie"]
["AMANCY LA ROCHE SUR FORON (74)","74990",null,null,null,null,null,null,"0974007001",16000,"Collectivité"]
["AMELIE PALALDA (66)","66917","Entrée station","Sortie station",null,null,null,null,"0966003002",20000,"Collectivité"]
["AMIEL (TREBES 11)",null,null,null,null,null,null,null,null,null,"Industrie"]
["AMORA MAILLE (CHEVIGNY ST SAUVEUR 21)","15357","Rejet usine",null,null,null,null,null,null,null,"Industrie","92-006"]
["AMORA MAILLE (DIJON 21)","15369F","Rejet usine",null,null,null,null,null,null,null,"Industrie"]
["AMPHENOL SOCAPEX (THYEZ 74 )","19047D","Sortie station",null,null,null,null,null,null,null,"Industrie"]
["AMPLEPUIS (69)","69970",null,null,null,null,null,null,"0969006001",5000,"Collectivité"]
["ANDANCETTE INTERCOMMUNALE (26)","26805",null,null,null,null,null,null,"0926009002",13000,"Collectivité"]
["ANDROS (PORTES LES VALENCE 26)","93336",null,null,null,null,null,null,null,null,"Industrie","SRR-11010"]
["ANDUZE (30)","30010",null,null,null,null,null,null,"0930010001",9000,"Collectivité"]
["ANIANE (34)","34010",null,null,null,null,null,null,"0934010001",3500,"Collectivité"]
["ANJOUTEY & ETUEFFONT (90)","90914",null,null,null,null,null,null,"0990003001",2000,"Collectivité"]
["ANNECY - CRAN GEVRIER (74)","74925","Entrée station","Sortie station","By-pass gènèral","By pass biofor",null,null,"0974093001",230000,"Collectivité"]
["ANNEMASSE (74)","74901","Entrée station","Sortie station","By-pass prétraitements","Déversoir Entrée",null,null,"0974012001",86000,"Collectivité"]
["ANNONAY (07)","07010","Entrée station","Sortie station 1","Sortie station 2",null,null,null,"0907010003",66000,"Collectivité"]
["ANSE (69)","69968",null,null,null,null,null,null,"0969009001",15000,"Collectivité"]
["ANTIBES ET BIOT (06)","06004","Entrée station","Sortie station",null,null,null,null,"0906004001",172000,"Collectivité"]
["AOSTE S.N.C. (AOSTE 38)","16798J","Entrée station","Sortie station",null,null,null,null,null,null,"Industrie"]
["APERAM STAINLESS SERVICES (PONT DE ROIDE 25)","27050",null,null,null,null,null,null,null,null,"Industrie","SRR-10021"]
["APPLICATION DES GAZ (SAINT GENIS LAVAL 69)","18042L","Sortie station",null,null,null,null,null,null,null,"Industrie"]
["APPRIEU (38)","38907",null,null,null,null,null,null,"0938013001",2100,"Collectivité"]
["APT (84)","84922",null,null,null,null,null,null,"0984003001",25000,"Collectivité"]
["AQUAVAL (STEP ZI DE ROUSSET) (ROUSSET 13)","64617",null,null,null,null,null,null,null,null,"Industrie","SRR-08018"]
["ARACHES LES CARROZ FLAINE (74)","74955",null,null,null,null,null,null,"0974014002",14400,"Collectivité"]
["ARACHES LES RACINES (74)","74014",null,null,null,null,null,null,"0974014004",15000,"Collectivité"]
["ARAMON (30)","30012",null,null,null,null,null,null,"0930012001",3600,"Collectivité"]
["ARBOIS ET MESNAY (39)","39013",null,null,null,null,null,null,"0939013001",20000,"Collectivité"]
["ARBOUANS (25)","25901","Entrée station","Sortie station","Surverse BO",null,null,null,"0925020001",72000,"Collectivité"]
["ARC SUR TILLE REMILLY (21)","21902",null,null,null,null,null,null,"0921021001",4500,"Collectivité"]
["ARCELOR MEDITERRANEE (FOS 13)","14931",null,null,null,null,null,null,null,null,"Industrie","95-008"]
["ARDHAG (EX BOXAL) (BEAUREPAIRE 38)","16809",null,null,null,null,null,null,null,null,"Industrie","SRR-"]
["AREGNO - LITTORAL (20)","20952",null,null,null,null,null,null,"0920020004",9600,"Collectivité"]
["ARENTHON LA ROCHE SUR FORON (74)","74990",null,null,null,null,null,null,"0974018001",34000,"Collectivité"]
["ARGELES SUR MER (66)","66981","Entrée station","Sortie Nord","Sortie Sud",null,null,null,"0966008001",90000,"Collectivité"]
["ARGELIERS (11)","11012",null,null,null,null,null,null,"0911012002",2300,"Collectivité"]
["ARJO WIGGINS DESSINS PAPIERS FINS (CHARAVINES 38 )","16841F","Entrée station","Sortie station",null,null,null,null,null,null,"Industrie"]
["ARJO WIGGINS DESSINS PAPIERS FINS (CHARAVINES 38)","16841",null,null,null,null,null,null,null,null,"Industrie","SRR-"]
["ARJO WIGGINS PALALDA (PALALDA 66)","80326",null,null,null,null,null,null,null,null,"Industrie","07-009"]
["ARJOBEX (RIVES SUR FURES 38)","49048",null,null,null,null,null,null,null,null,"Industrie","SRR-09006"]
["ARJOBEX (RIVES SUR FURES 38)","49048",null,null,null,null,null,null,null,null,"Industrie","SRR-09006"]
["ARKEMA (BALAN 13)","24985H","ENTREE PHYSICO","ENTREE BIO","SORTIE STATION","Rejet général",null,null,null,null,"Industrie"]
["ARKEMA (JARRIE 38)","24546","USINE NORD","USINE SUD","ENTREE BIO","SORTIE BIO",null,null,null,null,"Industrie","93-005"]
["ARKEMA (LA CHAMBRE 73)","24702",null,null,null,null,null,null,null,null,"Industrie","SRR-10014"]
["ARKEMA (MARSEILLE 13)","24701","Rejet Huileux","Rejet non Huileux","Sortie station",null,null,null,null,null,"Industrie","05-001"]
["ARKEMA (PIERRE BENITE 69)","24544","FOSSE NEUTRA","FOSSE DE RELEVAGE",null,null,null,null,null,null,"Industrie","95-006"]
["ARKEMA (SAINT FONS 69)","24651V","Rejet général",null,null,null,null,null,null,null,"Industrie"]
["ARKEMA FRANCE (ST-AUBAN 04)","24644","Entrée station Bio","Sortie Station Bio","Entrée station Physico","Effluents domestiques","Rejet Durance",null,null,null,"Industrie","99-001"]
["ARKOPHARMA (CARROS 06)","27107",null,null,null,null,null,null,null,null,"Industrie","SRR-"]
["ARLES - LES SALINS DE GIRAUD (13)","13942",null,null,null,null,null,null,"0913004009",2200,"Collectivité"]
["ARLES - PRINCIPALE (13)","13942","Entrée station","Sortie station",null,null,null,null,"0913004003",50000,"Collectivité"]
["ARMISSAN - VINASSAN (11)","11966",null,null,null,null,null,null,"0911014002",7500,"Collectivité"]
["ARS SUR FORMANS (01)","01021",null,null,null,null,null,null,"0901021002",2300,"Collectivité"]
["ARVIEUX (05)","05007",null,null,null,null,null,null,"0905007001",2500,"Collectivité"]
["ASCOMETAL (FOS SUR MER 13)","28905",null,null,null,null,null,null,null,null,"Industrie","SRR-10015"]
["ASCOMETAL (LE CHEYLAS 38)","16853U","Sortie station",null,null,null,null,null,null,null,"Industrie"]
["ASSOCIATION DES UTILISATEURS DE LA ZI NORD  (CHALON SUR SAONE 71)","19856H","Entrée station","Sortie station",null,null,null,null,null,null,"Industrie"]
["ATELIER D'OCCITANIE (NARBONNE 11)","27213E",null,null,null,null,null,null,null,null,"Industrie"]
["ATEMAX SUD EST (POINT) (VIRIAT 01)","96849",null,null,null,null,null,null,null,null,"Industrie","07-004"]
["AUBENAS - BOURDARY (07)","07962",null,null,null,null,null,null,"0907019003",24000,"Collectivité"]
["AUBENAS - TARTARY (07)","07019",null,null,null,null,null,null,"0907019002",5500,"Collectivité"]
["AUBERIVES SUR VAREZE (38)","38996",null,null,null,null,null,null,"0938019002",2000,"Collectivité"]
["AUPS (83)","83007",null,null,null,null,null,null,"0983007001",3000,"Collectivité"]
["AURIOL - VALLEE DE L'HUVEAUNE (13)","13931",null,null,null,null,null,null,"0913007002",10000,"Collectivité"]
["AUXON - MISEREY (25)","25910",null,null,null,null,null,null,"0925034002",5500,"Collectivité"]
["AUXONNE - CHEF-LIEU (21)","21038",null,null,null,null,null,null,"0921038003",25000,"Collectivité"]
["AVENE - CENTRE (34)","34944",null,null,null,null,null,null,"0934019003",3500,"Collectivité"]
["AVENTIS PASTEUR (MARCY L’ETOILE 69)","17973L","Rejet usine",null,null,null,null,null,null,null,"Industrie"]
["AVENTIS PHARMA (NEUVILLE SUR SAONE 69)","17982W","Entrée Prétraitement","Sortie station","Rejet direct",null,null,null,null,null,"Industrie"]
["AVIGNON (84)","84943","Entrée station","Sortie station",null,null,null,null,"0984007001",100000,"Collectivité"]
["B.P. LAVERA S.N.C. (LAVERA 13)","43452F","Entrée station","Sortie station",null,null,null,null,null,null,"Industrie"]
["BADEVEL (25)","25901","Sortie station","By-pass",null,null,null,null,"0925040001",2300,"Collectivité"]
["BAGES (66)","66011",null,null,null,null,null,null,"0966011002",5000,"Collectivité"]
["BAGNOLS SUR CEZE - EUZE (30)","30989",null,null,null,null,null,null,"0930028003",35000,"Collectivité"]
["BAHO (66)","66966",null,null,null,null,null,null,"0966012002",3200,"Collectivité"]
["BAIKOWSKI CHIMIE (POISY 74)","19178",null,null,null,null,null,null,null,null,"Industrie","SRR-10018"]
["BAILLARGUES (34)","34926",null,null,null,null,null,null,"0934022001",5000,"Collectivité"]
["BAINS LES BAINS (88)","88029",null,null,null,null,null,null,"060988029001",2800,"Collectivité"]
["BAIXAS (66)","66966",null,null,null,null,null,null,"0966014001",2700,"Collectivité"]
["BALL PACKAGING EUROPE (LA CIOTAT 13)","35685",null,null,null,null,null,null,null,null,"Industrie","SRR-11011"]
["BANON (04)","04018",null,null,null,null,null,null,"0904018001",2500,"Collectivité"]
["BANYULS (66)","66981",null,null,null,null,null,null,"0966016001",11300,"Collectivité"]
["BANYULS DELS ASPRES (66)","66977",null,null,null,null,null,null,"0966015001",3450,"Collectivité"]
["BARBENTANE - CHEF LIEU (13)","13010",null,null,null,null,null,null,"0913010002",5000,"Collectivité"]
["BARCELONNETTE - SAINT PONS (04)","04906",null,null,null,null,null,null,"0904195002",38000,"Collectivité"]
["BARJAC (30)","30029",null,null,null,null,null,null,"0930029002",4500,"Collectivité"]
["BARJOLS (83)","83012",null,null,null,null,null,null,"0983012001",3500,"Collectivité"]
["BASF ORGAMOL (ST VULBAS 01)","40685",null,null,null,null,null,null,null,null,"Industrie","99-006"]
["BASTIA - NORD (2B)","20902","Entrée station","Sortie station","By-pass",null,null,null,"0920033002",45000,"Collectivité"]
["BASTIA - SUD (2B)","20902","Entrée station","Sortie station","By-pass",null,null,null,"0920033001",50000,"Collectivité"]
["BAUME LES DAMES (25)","25047",null,null,null,null,null,null,"0925047001",8000,"Collectivité"]
["BAVANS (25)","25901","Entrée station","Sortie droite station","Sortie gauche station","Surverse bassin orage","Sortie bassin d'orage",null,"0925048001",19800,"Collectivité"]
["BAYER CROPSCIENCE (SOPHIA ANTIOPOLIS 06)","32660A",null,null,null,null,null,null,null,null,"Industrie"]
["BB PLUME (TRAMBLY 71 )","54318S","Entrée station","Sortie station",null,null,null,null,null,null,"Industrie"]
["BEAUCAIRE (30)","30032",null,null,null,null,null,null,"0930032001",30000,"Collectivité"]
["BEAUCHASTEL (07)","07027",null,null,null,null,null,null,"0907027001",2500,"Collectivité"]
["BEAUCOURT (90)","90009",null,null,null,null,null,null,"0990009002",7000,"Collectivité"]
["BEAUFOUR IPSEN INDUSTRIE (L'ISLE SUR LA SORGUE 84)","10407",null,null,null,null,null,null,null,null,"Industrie","SRR-11008"]
["BEAUJEU (69)","69018",null,null,null,null,null,null,"0969018001",2900,"Collectivité"]
["BEAUMES DE VENISE - AUBIGNAN (84)","84903",null,null,null,null,null,null,"0984004002",16000,"Collectivité"]
["BEAUNE - COMBERTAULT (21)","21810","Entrée station","Sortie station","By-pass","Surverse BO",null,null,"0921185001",99000,"Collectivité"]
["BEAUREPAIRE (38)","38910",null,null,null,null,null,null,"0938034001",12500,"Collectivité"]
["BEAUSOLEIL - MONACO (06)","06012",null,null,null,null,null,null,"0906012001",17000,"Collectivité"]
["BEAUSSET - LE CASTELLET (83)","83912",null,null,null,null,null,null,"0983035001",30000,"Collectivité"]
["BEAUVEZER (04)","04907",null,null,null,null,null,null,"0904025001",6000,"Collectivité"]
["BEAUVOISIN GENERAC (30)","30941",null,null,null,null,null,null,"0930033002",9500,"Collectivité"]
["BEDARIEUX (34)","34028",null,null,null,null,null,null,"0934028001",10000,"Collectivité"]
["BEDARRIDES (84)","84903",null,null,null,null,null,null,"0984016001",5900,"Collectivité"]
["BEDOIN (84)","84903",null,null,null,null,null,null,"0984017002",7500,"Collectivité"]
["BELFORT (90)","90903","Entrée station","Sortie station C1","Sortie station C2","Sortie station C3",null,null,"0990010001",110000,"Collectivité"]
["BELGODERE - LOZARI (20)","20922",null,null,null,null,null,null,"0920034002",6000,"Collectivité"]
["BELLEGARDE (30)","30034",null,null,null,null,null,null,"0930034001",8000,"Collectivité"]
["BELLEGARDE SUR VALSERINE (01)","01033",null,null,null,null,null,null,"0901033001",18000,"Collectivité"]
["BELLENTRE (73)","73038",null,null,null,null,null,null,"0973038001",13500,"Collectivité"]
["BELLEVILLE SUR SAONE (69)","69019",null,null,null,null,null,null,"0969019001",14000,"Collectivité"]
["BELLEY - CHEF LIEU (01)","01034",null,null,null,null,null,null,"0901034001",20000,"Collectivité"]
["BERNEX (74)","72183",null,null,null,null,null,null,"0974033001",4000,"Collectivité"]
["BERNIS AUBORD (30)","30995",null,null,null,null,null,null,"0930036002",7000,"Collectivité"]
["BERRE L'ETANG - CHEF LIEU (13)","13940",null,null,null,null,null,null,"0913014001",21000,"Collectivité"]
["BESANCON - PORT DOUVOT (25)","25056","Entrée station","Sortie T1-1","Sortie T1-2","Sortie T2-1","Sortie T2-2",null,"0925056002",200000,"Collectivité"]
["BESANCON - THIZE CHALEZEULE (25)","25943","Entrée station","Sortie station","Déversoir",null,null,null,"0925112001",5900,"Collectivité"]
["BESSAN (34)","34031",null,null,null,null,null,null,"0934031001",5400,"Collectivité"]
["BESSE SUR ISSOLE (83)","83018",null,null,null,null,null,null,"0983018002",3300,"Collectivité"]
["BESSEGES (30)","30037",null,null,null,null,null,null,"0930037002",12000,"Collectivité"]
["BESSENAY (69)","69021",null,null,null,null,null,null,"0969021002",2500,"Collectivité"]
["BESSIERE (MEZE 34)",null,"Rejet général",null,null,null,null,null,null,null,"Industrie"]
["BEUIL - VILLAGE (06)","06016",null,null,null,null,null,null,"0906016002",2000,"Collectivité"]
["BEYNOST - SAINT MAURICE DE BEYNOST (01)","01950",null,null,null,null,null,null,"0901043001",10600,"Collectivité"]
["BEZIERS (34)","34988","Entrée station","Sortie station","Déversoir Entrée station","By-pass prétraitement",null,null,"0934032001",102000,"Collectivité"]
["BIANS LES USIERS (25)","25906",null,null,null,null,null,null,"0925060001",3400,"Collectivité"]
["BIGARD (CUISEAUX 71)","36936",null,null,null,null,null,null,null,null,"Industrie","SRR-09014"]
["BIOLANDES (GRASSE 06)","55529H","Rejet Usine diluées","Rejet Usine concentrés",null,null,null,null,null,null,"Industrie"]
["BIZANET (11)","11966",null,null,null,null,null,null,"0911040001",2100,"Collectivité"]
["BLACE (69)","69023",null,null,null,null,null,null,"0969023001",2000,"Collectivité"]
["BLANCHIN S.A. (CHAMPAGNEUX 73)","63241R","Entrée station","Sortie station",null,null,null,null,null,null,"Industrie"]
["BLETTERANS (39)","39904",null,null,null,null,null,null,"0939056001",4100,"Collectivité"]
["BLUESTAR SILICONES (ST FONS 69)","18029",null,null,null,null,null,null,null,null,"Industrie","95-005"]
["BODYCOTE HIT Industries (CHASSIEU 69)","18271K","Sortie station",null,null,null,null,null,null,null,"Industrie"]
["BOGEVE (74)","74038",null,null,null,null,null,null,"0974038001",2600,"Collectivité"]
["BOIRON FAUGIER (DONZERE 26)",null,"Rejet Boiron","Rejet Faugier","Rejet général",null,null,null,null,null,"Industrie"]
["BOIS D'AMONT (39)","39059",null,null,null,null,null,null,"0939059002",4200,"Collectivité"]
["BOLLENE - LA CROISIERE (84)","84019",null,null,null,null,null,null,"0984019007",3500,"Collectivité"]
["BOLLENE - L'ECLUSE (84)","84019",null,null,null,null,null,null,"0984019004",3800,"Collectivité"]
["BOLLENE - MARTINIERE (84)","84019",null,null,null,null,null,null,"0984019005",9500,"Collectivité"]
["BOLQUERE (66)","66020",null,null,null,null,null,null,"0966020002",9000,"Collectivité"]
["BONDUELLE FRAIS (GENAS 69)","46647D","Rejet général",null,null,null,null,null,null,null,"Industrie"]
["BONIFACIO (20)","20041",null,null,null,null,null,null,"0920041002",8000,"Collectivité"]
["BONNE SUR MENOGE CRANVES (74)","78385",null,null,null,null,null,null,"0974040001",7500,"Collectivité"]
["BONNEVILLE (74)","74816",null,null,null,null,null,null,"0974042001",24000,"Collectivité"]
["BONNIEUX (84)","84020",null,null,null,null,null,null,"0984020001",2000,"Collectivité"]
["BORGO - LITTORAL (20)","20906",null,null,null,null,null,null,"0920042003",30000,"Collectivité"]
["BORGO NORD (20)","20906",null,null,null,null,null,null,"0920042002",3300,"Collectivité"]
["BORGO SUD (20)","20906",null,null,null,null,null,null,"0920042001",3000,"Collectivité"]
["BORMES LES MIMOSAS - LE LAVANDOU (83)","83913","Entrée station","Sortie biologique 1","Sortie biologique 2","Sortie physico","By-pass","By-pass tampon","0983019001",90000,"Collectivité"]
["BOUC BEL AIR - NOUVELLE (13)","13916",null,null,null,null,null,null,"0913015002",20000,"Collectivité"]
["BOUC BEL AIR (13)",null,null,null,null,null,null,null,"0913015001",20000,"Collectivité"]
["BOUCLANS (25)","25979",null,null,null,null,null,null,"0925078001",3800,"Collectivité"]
["BOUILLARGUES (30)","30817",null,null,null,null,null,null,"0930047001",7000,"Collectivité"]
["BOUJAN S.LIBRON (34)","34988",null,null,null,null,null,null,"0934037002",5200,"Collectivité"]
["BOURBON AP (MORTEAU 25)","15764",null,null,null,null,null,null,null,null,"Industrie","SRR-"]
["BOURBONNE LES BAINS (52)","52915",null,null,null,null,null,null,"0952060001",5500,"Collectivité"]
["BOURG ARGENTAL (42)","42023",null,null,null,null,null,null,"0942023001",5000,"Collectivité"]
["BOURG EN BRESSE (01)","01053","Entrée station","Sortie station","By-pass",null,null,null,"0901451003",110000,"Collectivité"]
["BOURG SAINT ANDEOL (07)","07042",null,null,null,null,null,null,"0907042001",6800,"Collectivité"]
["BOURG SAINT CHRISTOPHE (01)","01054",null,null,null,null,null,null,"0901054001",2000,"Collectivité"]
["BOURG SAINT MAURICE (73)","73054",null,null,null,null,null,null,"0973054001",56000,"Collectivité"]
["BOURGEAT S.A. (LES ABRETS 38)",null,null,null,null,null,null,null,null,null,"Industrie"]
["BOURGET DU LAC - SUD (73)","73925",null,null,null,null,null,null,"0973051002",10000,"Collectivité"]
["BOURGOIN JALLIEU (38)","38928","Entrée station","Sortie station",null,null,null,null,"0938053001",78000,"Collectivité"]
["BOUROGNE - VILLE (90)","90903",null,null,null,null,null,null,"0990017001",2000,"Collectivité"]
["BOUROGNE Z.I. (90)","90903",null,null,null,null,null,null,"0990017003",5000,"Collectivité"]
["BOXAL (BEAUREPAIRE 38)","16809W","Sortie station",null,null,null,null,null,null,null,"Industrie"]
["BOZEL - SAINT BON TARENTAISE (73)","73934",null,null,null,null,null,null,"0973055001",24000,"Collectivité"]
["BRAM (11)","11049",null,null,null,null,null,null,"0911049001",2500,"Collectivité"]
["BRAS (83)","83021",null,null,null,null,null,null,"0983021002",2800,"Collectivité"]
["BRAZEY EN PLAINE (21)","21103",null,null,null,null,null,null,"0921103002",4000,"Collectivité"]
["BRESSOR (GRIEGES 01)","14117",null,null,null,null,null,null,null,null,"Industrie","SRR-13001"]
["BRESSOR (SERVAS 01)","14235",null,null,null,null,null,null,null,null,"Industrie","SRR-09027"]
["BRESSOR SERVAS (SAINT PAUL DE VARAX 01)","14235Y","Entrée station","Sortie station","Eaux refroidi-ssement","Entrée CAPA",null,null,null,null,"Industrie"]
["BREUCHES-BAUDONCOURT (70)","70901",null,null,null,null,null,null,"0970470001",2700,"Collectivité"]
["BRIANCON (05)","05906",null,null,null,null,null,null,"0905023001",45000,"Collectivité"]
["BRIGNOLES (83)","83023",null,null,null,null,null,null,"0983023004",20000,"Collectivité"]
["BRUN D'ARRE (ARRE 30 )","16106G","Entrée station","Sortie station",null,null,null,null,null,null,"Industrie"]
["BTMF (MARSEILLE 13)",null,"Rejet usine",null,null,null,null,null,null,null,"Industrie"]
["BUIS LES BARONIES (26)","26063",null,null,null,null,null,null,"0926063001",5200,"Collectivité"]
["BUSY - LARNOD ET VORGES (25)","25947",null,null,null,null,null,null,"0925103002",2700,"Collectivité"]
["BUXY (71)","71070",null,null,null,null,null,null,"0971070002",3300,"Collectivité"]
["CABANNES (13)","13904",null,null,null,null,null,null,"0913018002",4000,"Collectivité"]
["CABESTANY (66)","66028",null,null,null,null,null,null,"0966028002",18000,"Collectivité"]
["CABRIES (13)","13019",null,null,null,null,null,null,"0913019001",5000,"Collectivité"]
["CADENET (84)","84905",null,null,null,null,null,null,"0984026002",4200,"Collectivité"]
["CAGNES SUR MER (06)","06953","Entrée station","Sortie 3","Sortie 4","Sortie 5",null,null,"0906027001",130000,"Collectivité"]
["CAISSARGUES (30)","30817",null,null,null,null,null,null,"0930060001",5000,"Collectivité"]
["CALACUCCIA (20)","20047",null,null,null,null,null,null,"0920047001",2200,"Collectivité"]
["CALLAS (83)","83028",null,null,null,null,null,null,"0983028002",3500,"Collectivité"]
["CALVI (20)","20050","Entrée station","Sortie station",null,null,null,null,"0920050001",60000,"Collectivité"]
["CALVISSON - CHEF LIEU (30)","30062",null,null,null,null,null,null,"0930062002",5600,"Collectivité"]
["CAMARET (CAMARET SUR AIGUES 84)","64615J","Entrée station","Sortie station","By-pass",null,null,null,null,null,"Industrie"]
["CAMARET SUR AIGUES (84)","84029",null,null,null,null,null,null,"0984029001",61800,"Collectivité"]
["CAMERON FRANCE SAS (BEZIERS 34)","16441","Sortie station",null,null,null,null,null,null,null,"Industrie"]
["CAMPBELL (LE PONTET 84)","19707","Entrée station","Sortie station",null,null,null,null,null,null,"Industrie","SRR-12009"]
["CAMPS LA SOURCE (83)","83030",null,null,null,null,null,null,"0983030002",2500,"Collectivité"]
["CANDIA (CEDILAC) (VIENNE 38)","17170",null,null,null,null,null,null,null,null,"Industrie","92-007"]
["CANET (34)","34051",null,null,null,null,null,null,"0934051002",2100,"Collectivité"]
["CANET D'AUDE (11)","11067",null,null,null,null,null,null,"0911067001",2000,"Collectivité"]
["CANET EN ROUSSILLON - ??? (66)","66966",null,null,null,null,null,null,"0966037003",66000,"Collectivité"]
["CANET EN ROUSSILLON (66)","66966","Entrée station","Sortie biologique","Sortie physico",null,null,null,"0966037002",75000,"Collectivité"]
["CANNES - MANDELIEU (06)","75238","Entrée station","Sortie station",null,null,null,null,"0906079001",238000,"Collectivité"]
["CAP D'AIL MONACO (06)","06910",null,null,null,null,null,null,"0906032001",8000,"Collectivité"]
["CAPENDU MARSEILLETTE (11)","11068",null,null,null,null,null,null,"0911068001",3600,"Collectivité"]
["CAPESTANG (34)","34052",null,null,null,null,null,null,"0934052001",3500,"Collectivité"]
["CARCASSONNE - SAINT JEAN (11)","11069","Entrée station","Sortie station",null,null,null,null,"0911069001",120000,"Collectivité"]
["CARCES (83)","83032",null,null,null,null,null,null,"0983032002",4700,"Collectivité"]
["CARGESE (20)","20065",null,null,null,null,null,null,"0920065001",10000,"Collectivité"]
["CARNOULES (83)","83033",null,null,null,null,null,null,"0983033001",2100,"Collectivité"]
["CAROMB (84)","84030",null,null,null,null,null,null,"0984030002",4000,"Collectivité"]
["CARPENTRAS - CHEF-LIEU (84)","84031",null,null,null,null,null,null,"0984031001",46000,"Collectivité"]
["CASSIS (13)","13939",null,null,null,null,null,null,"0913022001",25000,"Collectivité"]
["CASTAGNIERS (06)","06953",null,null,null,null,null,null,"0906034001",4000,"Collectivité"]
["CASTELLANE CHEF-LIEU (04)","04039",null,null,null,null,null,null,"0904039001",12500,"Collectivité"]
["CASTELLARE CASINCA VESCOVATO (20)","20955",null,null,null,null,null,null,"0920077001",18000,"Collectivité"]
["CASTELNAU DE GUERS (34)","34056",null,null,null,null,null,null,"0934056001",2500,"Collectivité"]
["CASTELNAUDARY - ESTANG BIGOU (11)","11076",null,null,null,null,null,null,"0911076002",6500,"Collectivité"]
["CASTELNAUDARY - SUD MOLINIER (11)","10103",null,null,null,null,null,null,"0911076003",40000,"Collectivité"]
["CASTRIES (34)","34926",null,null,null,null,null,null,"0934058002",6300,"Collectivité"]
["CAUMONT SUR DURANCE (84)","84943",null,null,null,null,null,null,"0984034002",4000,"Collectivité"]
["CAUNES-MINERVOIS (11)","11081",null,null,null,null,null,null,"0911081001",3000,"Collectivité"]
["CAVAILLON - CHEF-LIEU (84)","84035",null,null,null,null,null,null,"0984035003",25000,"Collectivité"]
["CAVALAIRE - LA CROIX VALMER (83)","83920",null,null,null,null,null,null,"0983036001",68000,"Collectivité"]
["CAVE COOP CHUSCLAN (CHUSCLAN 30 )","16154J","Entrée station","Sortie station",null,null,null,null,null,null,"Industrie"]
["CAVE COOP D'ANSOUIS (ANSOUIS 84)","19555F","Entrée station","Sortie station",null,null,null,null,null,null,"Industrie"]
["CAVE COOP DE BEAUCAIRE (BEAUCAIRE 30 )","16118V","Entrée station","Sortie station",null,null,null,null,null,null,"Industrie"]
["CAVE COOP DE BELLEGARDE \"LA CLAIRETTE\" (BELLEGARDE 30 )","16129G","Entrée station","Sortie station",null,null,null,null,null,null,"Industrie"]
["CAVE COOP DE ROCHEFORT (ROCHEFORT DU GARD 30 )","16274C","Entrée station","Sortie station",null,null,null,null,null,null,"Industrie"]
["CAVE COOP DE VENDARGUES \"LES CRES\" (VENDARGUES 34 )","16763W","Entrée station","Sortie station",null,null,null,null,null,null,"Industrie"]
["CAVE COOP LES VIGNERONS REUNIS  (SAINTE CECILE LES VIGNES 84)","19724P","Entrée station","Sortie station",null,null,null,null,null,null,"Industrie"]
["CAVE COOP ST GERVAIS (ST GERVAIS 30 )","16294L","Entrée station","Sortie station",null,null,null,null,null,null,"Industrie"]
["CAVE COOPERATIVE DE BOURDIC (BOURDIC 30)","16137R","Entrée station","Sortie station",null,null,null,null,null,null,"Industrie"]
["CAVE COOPERATIVE DE CAROMB","19614V","Entrée station","Sortie station",null,null,null,null,null,null,"Industrie"]
["CAVE COOPERATIVE DE GRAMBOIS","19657S","Entrée station","Sortie station",null,null,null,null,null,null,"Industrie"]
["CAVE COOPERATIVE DE LAURIS","19666B","Entrée station","Sortie station",null,null,null,null,null,null,"Industrie"]
["CAVE COOPERATIVE DE RICHERENCHES","22900S","Entrée station","Sortie station",null,null,null,null,null,null,"Industrie"]
["CAVE COOPERATIVE LES VIGNERONS REUNIS","19724P","Sortie station",null,null,null,null,null,null,null,"Industrie"]
["CAVE COSTIERES DE GALLICIAN (VEAUVERT 30 )","16355C","Entrée station","Sortie station",null,null,null,null,null,null,"Industrie"]
["CAVE DE TAVEL (TAVEL 30 )","16340L","Entrée station","Sortie station",null,null,null,null,null,null,"Industrie"]
["CAVE LES VIGNERONS ST HILAIRE (ST HILAIRE D'OZILHAN 30 )","16302V","Entrée station","Sortie station",null,null,null,null,null,null,"Industrie"]
["CAVEIRAC (30)","30817",null,null,null,null,null,null,"0930075002",5000,"Collectivité"]
["CAZOULS LES BEZIERS (34)","44708",null,null,null,null,null,null,"0934069001",4200,"Collectivité"]
["CDC CUSENIER (THUIR 66)",null,null,null,null,null,null,null,null,null,"Industrie"]
["CECO ORANGINA (SIGNES 83)","33500N","Entrée station","Sortie station",null,null,null,null,null,null,"Industrie"]
["CEDILAC (VIENNE 38)","17170N","Entrée station","Sortie station",null,null,null,null,null,null,"Industrie"]
["CENDRAS L'ABBAYE (30)","30815",null,null,null,null,null,null,"0930077003",2000,"Collectivité"]
["CENTIPHARM (GRASSE 06)","29731",null,null,null,null,null,null,null,null,"Industrie","02-002"]
["CERBERE (66)","66981",null,null,null,null,null,null,"0966048002",6800,"Collectivité"]
["CERET (66)","66049",null,null,null,null,null,null,"0966049001",10000,"Collectivité"]
["CERS (34)","34988",null,null,null,null,null,null,"0934073001",3200,"Collectivité"]
["CERTINES VAVRETTES (01)","01806",null,null,null,null,null,null,"0901069002",4500,"Collectivité"]
["CERVIONE (20)","20920",null,null,null,null,null,null,"0920087001",2500,"Collectivité"]
["CESSENON (34)","34074",null,null,null,null,null,null,"0934074001",2000,"Collectivité"]
["CESSIEU - LA TOUR DU PIN (38)","38977",null,null,null,null,null,null,"0938064002",18000,"Collectivité"]
["CEZUS CHIMIE (JARRIE 38)","28714","Entrée station KROLL","Sortie station KROLL","Entrée station CHIMIE","Sortie station CHIMIE","Rejet global",null,null,null,"Industrie","95-003"]
["CHABOTTES - CHAMPSAUR (05)","05914",null,null,null,null,null,null,"0905029001",17000,"Collectivité"]
["CHAGNY (71)","71073",null,null,null,null,null,null,"0971073002",5800,"Collectivité"]
["CHALAMONT (01)","01074",null,null,null,null,null,null,"0901074002",2500,"Collectivité"]
["CHALINDREY (52)","52093",null,null,null,null,null,null,"0952093001",4000,"Collectivité"]
["CHALON SUR SAONE (71)","47807","Entrée station","Sortie station","Sortie BO",null,null,null,"0971076001",84000,"Collectivité"]
["CHAMBERY (73)","73908","Entrée station","Sortie AT","Sortie NT","By-pass Physico",null,null,"0973065001",290000,"Collectivité"]
["CHAMOUSSET PONT ROYAL (73)","73894",null,null,null,null,null,null,"0973068001",3000,"Collectivité"]
["CHAMPAGNOLE (39)","39991",null,null,null,null,null,null,"0939097001",22000,"Collectivité"]
["CHAMPVANS (39)","39101",null,null,null,null,null,null,"0939101001",2000,"Collectivité"]
["CHARABOT S.A. Usine du PLAN GRASSE (GRASSE 06)","63299D","Rejet usine",null,null,null,null,null,null,null,"Industrie"]
["CHARABOT S.A. Usine GRASSE (GRASSE 06)","14405H","Rejet usine",null,null,null,null,null,null,null,"Industrie"]
["CHARAVINES - LAC DE PALADRU (38)","38955",null,null,null,null,null,null,"0938082002",11500,"Collectivité"]
["CHARDON & COUCHOUD (DAGNEUX 01)","27102",null,null,null,null,null,null,null,null,"Industrie","SRR-"]
["CHARLES FARAUD (MONTEUX 84)","19679",null,null,null,null,null,null,null,null,"Industrie","SRR-12011"]
["CHARLEVAL (13)","13940",null,null,null,null,null,null,"0913024002",3000,"Collectivité"]
["CHARQUEMONT (25)","25127",null,null,null,null,null,null,"0925127001",4500,"Collectivité"]
["CHASSE SUR RHONE (38)","38965",null,null,null,null,null,null,"0938087001",15000,"Collectivité"]
["CHASSELAY (69)","69049",null,null,null,null,null,null,"0969049001",2300,"Collectivité"]
["CHATEAU GAILLARD AMBERIEU (01)","01978",null,null,null,null,null,null,"0901089002",33000,"Collectivité"]
["CHATEAUNEUF DE GADAGNE (84)","84036",null,null,null,null,null,null,"0984036002",4000,"Collectivité"]
["CHATEAUNEUF DE GRASSE (06)","06914",null,null,null,null,null,null,"0906038002",2500,"Collectivité"]
["CHATEAUNEUF DU PAPE (84)","84903",null,null,null,null,null,null,"0984037001",7000,"Collectivité"]
["CHATEAUNEUF DU RHONE (26)","26085",null,null,null,null,null,null,"0926085001",2300,"Collectivité"]
["CHATEAUNEUF LES MARTIGUES (13)","13939",null,null,null,null,null,null,"0913026003",16000,"Collectivité"]
["CHATEAUNEUF MARTIGUES-LA MEDE (13)",null,null,null,null,null,null,null,"0913026001",3000,"Collectivité"]
["CHATEAURENARD - VILLE (13)","13027",null,null,null,null,null,null,"0913027001",10000,"Collectivité"]
["CHATEAUROUX CHEF-LIEU (05)","05912",null,null,null,null,null,null,"0905036001",4000,"Collectivité"]
["CHATENOIS LES FORGES (90)","90903",null,null,null,null,null,null,"0990022001",3300,"Collectivité"]
["CHATILLON D' AZERGUES (69)","69959",null,null,null,null,null,null,"0969050002",9000,"Collectivité"]
["CHATILLON EN DIOIS (26)","26086",null,null,null,null,null,null,"0926086001",2100,"Collectivité"]
["CHATILLON EN MICHAILLE BOURG (01)","01091",null,null,null,null,null,null,"0901091002",2300,"Collectivité"]
["CHATILLON SUR CHALARONNE (01)","01093",null,null,null,null,null,null,"0901093001",5400,"Collectivité"]
["CHAUSSIN ASNANS (39)","39910",null,null,null,null,null,null,"0939128001",2900,"Collectivité"]
["CHAVANOZ - PONT DE CHERUY (38)","38973",null,null,null,null,null,null,"0938097001",30000,"Collectivité"]
["CHAZAY D'AZERGUES LE MOULIN (69)","69990",null,null,null,null,null,null,"0969052004",4100,"Collectivité"]
["CHEDDITE FRANCE SA (BOURG LES VALENCE 26)","24522","Sortie station",null,null,null,null,null,null,null,"Industrie","SRR-11006"]
["CHENEBIER (70)","70811",null,null,null,null,null,null,"0970149001",2300,"Collectivité"]
["CHEVAL BLANC (84)","84038",null,null,null,null,null,null,"0984038001",3000,"Collectivité"]
["CHEVIGNY SAINT SAUVEUR (21)","21910","Entrée station","Sortie station","By-pass",null,null,null,"0921171001",80000,"Collectivité"]
["CHEVREMONT - PEROUSE (90)","90903",null,null,null,null,null,null,"0990026002",4000,"Collectivité"]
["CHOMERAC VERONE (07)","07965",null,null,null,null,null,null,"0907066002",4000,"Collectivité"]
["CHORGES - LES RISOULS (05)","05931",null,null,null,null,null,null,"0905040006",2200,"Collectivité"]
["CIBA SPECIALITES CHIMIQUES (SAINT FONS 69)","18032A","Envoi GEPEIF","Rejet ULTRAFILTRATION","REJET COURLY",null,null,null,null,null,"Industrie"]
["CIBEVIAL (CORBAS 69)","18281W","Entrée station","Rejet général",null,null,null,null,null,null,"Industrie"]
["CIE PETROCHIMIQUE DE BERRE SAS (CHIMIE) (BERRE 13)","78272",null,null,null,null,null,null,null,null,"Industrie","96-002"]
["CLAIRA (66)","66050",null,null,null,null,null,null,"0966050001",2400,"Collectivité"]
["CLAIRVAUX LES LACS (39)","39800",null,null,null,null,null,null,"0939154002",6500,"Collectivité"]
["CLARENSAC (30)","30817",null,null,null,null,null,null,"0930082002",9500,"Collectivité"]
["CLENAY - SAINT JULIEN (21)","21911",null,null,null,null,null,null,"0921555001",8000,"Collectivité"]
["CLERMONT L'HERAULT (34)","34934",null,null,null,null,null,null,"0934079001",22000,"Collectivité"]
["CLUNY (71)","71137","Entrée station","Sortie station","By-pass","Déversoir",null,null,"0971137001",4500,"Collectivité"]
["CLUSES (74)","74936",null,null,null,null,null,null,"0974164001",70000,"Collectivité"]
["COATEX USINE 1 (GENAY 69 )","49185M","Entrée station","Sortie station",null,null,null,null,null,null,"Industrie"]
["COCA COLA (LES PENNES MIRABEAU 13)","15167","Entrée station","Sortie station",null,null,null,null,null,null,"Industrie","99-008"]
["CODOGNAN (30)","30930",null,null,null,null,null,null,"0930083002",16500,"Collectivité"]
["CŒUR D'OR (MAICHE 25 )","15740J","Sortie station",null,null,null,null,null,null,null,"Industrie"]
["COGEMA (PIERRELATTE 26)","10089S",null,null,null,null,null,null,null,null,"Industrie"]
["COGGIA SAGONE LIAMONE (20)","20917",null,null,null,null,null,null,"0920090002",10000,"Collectivité"]
["COGOLIN - FONT-MOURIER (83)","83932",null,null,null,null,null,null,"0983042003",40000,"Collectivité"]
["COGOLIN (83)","83932",null,null,null,null,null,null,"0983042002",10000,"Collectivité"]
["COLLIOURE - PORT VENDRES (66)","66981",null,null,null,null,null,null,"0966148002",28000,"Collectivité"]
["COLLOBRIERES (83)","83043",null,null,null,null,null,null,"0983043001",3700,"Collectivité"]
["COLLONGES (01)","01990",null,null,null,null,null,null,"0901109001",2000,"Collectivité"]
["COLLONGES SOUS SALEVE BOURG (74)","74917",null,null,null,null,null,null,"0974082001",4000,"Collectivité"]
["COLOMBIER FONTAINE (25)","25801","Sortie station",null,null,null,null,null,"0925159002",2300,"Collectivité"]
["COLOMBIERS (34)","34081",null,null,null,null,null,null,"0934081001",2000,"Collectivité"]
["COMBAILLAUX - TRUC DE LA REINE (34)","34082",null,null,null,null,null,null,"0934082003",2200,"Collectivité"]
["COMPAGNIE RODANIENNE (CASTILLON DU GARD 30)",null,"Rejet usine",null,null,null,null,null,null,null,"Industrie"]
["COMPS (30)","30089",null,null,null,null,null,null,"0930089002",2500,"Collectivité"]
["COMURHEX (NARBONNE 11)","14777N","Entrée Bassin de régulation","Rejet canal",null,null,null,null,null,null,"Industrie"]
["COMURHEX (PIERRELATTE 26)","22231P",null,null,null,null,null,null,null,null,"Industrie"]
["CONCA (20)","20918",null,null,null,null,null,null,"0920092001",2500,"Collectivité"]
["CONFLANDEY INDUSTRIE (PA) (PORT D'ATELIER 70)","77402",null,null,null,null,null,null,null,null,"Industrie","07-007"]
["CONFLANDEY INDUSTRIES (CONFLANDEY 70)","75327",null,null,null,null,null,null,null,null,"Industrie","07-006"]
["CONNAUX (30)","30917",null,null,null,null,null,null,"0930092002",7000,"Collectivité"]
["CONQUES SUR ORBIEL ET VILLALIER (11)","11099",null,null,null,null,null,null,"0911410001",2900,"Collectivité"]
["CONSERVERIE DU LANGUEDOC (CASTELNAUDARY 11)",null,null,"Sortie station",null,null,null,null,null,null,"Industrie"]
["CONSERVES DE PROVENCE  \"LE CABANON\" (CAMARET 84)","72090",null,null,null,null,null,null,null,null,"Industrie","94-003"]
["CONSERVES FRANCE (TARASCON 13)","15214","Entrée station","Sortie station","Rejet usine",null,null,null,null,null,"Industrie","00-008"]
["CONSERVES FRANCE (VAUVERT 30)","16353",null,null,null,null,null,null,null,null,"Industrie","SRR-09008"]
["CONTINENTALE NUTRITION (Vedène 84 )","46740E","Entrée station","Sortie station",null,null,null,null,null,null,"Industrie"]
["COOP HTS VALS SAONE (ABONCOURT 70 )","18372V","Entrée station","Sortie station",null,null,null,null,null,null,"Industrie"]
["COOP MONTS DE JOUX (BANNANS 25)","15530",null,null,null,null,null,null,null,null,"Industrie","SRR-09004"]
["COOP SALES (SALES 74 )","19232E","Rejet Commune","Rejet Fromagerie","Sortie station",null,null,null,null,null,"Industrie"]
["COOP VINICOLE TOUR DE FRANCE ( 66 )","17558K","Entrée station","Sortie station",null,null,null,null,null,null,"Industrie"]
["COOP VINICOLE VIN SYLLA (APT 84 )",null,"Entrée station","Sortie station",null,null,null,null,null,null,"Industrie"]
["COOPERATIVE D'ABATTAGE DE BOURG (BOURG EN BRESSE 01)",null,null,null,null,null,null,null,null,null,"Industrie"]
["COOPERATIVE DES MONTS DE JOUX (BANNANS 25)","15530F","Entrée station","Sortie station",null,null,null,null,null,null,"Industrie"]
["CORNAS (07)","07980",null,null,null,null,null,null,"0907070001",2500,"Collectivité"]
["CORNEILLA DEL VERCOL (66)","66059","Sortie station",null,null,null,null,null,"0966059002",2400,"Collectivité"]
["CORNEILLA LA RIVIERE (66)","66058",null,null,null,null,null,null,"0966058002",2000,"Collectivité"]
["CORNILLON (30)","30096",null,null,null,null,null,null,"0930096002",2000,"Collectivité"]
["CORNU SA (FONTAIN 25)",null,null,null,null,null,null,null,null,null,"Industrie"]
["CORRE (70)","70177",null,null,null,null,null,null,"0970177001",2000,"Collectivité"]
["CORTE (20)","20958",null,null,null,null,null,null,"0920096001",8500,"Collectivité"]
["COTIGNAC (83)","83046",null,null,null,null,null,null,"0983046001",3100,"Collectivité"]
["COUCHES (71)","71932",null,null,null,null,null,null,"0971149003",2200,"Collectivité"]
["COUDOUX VENTABREN (13)","13930",null,null,null,null,null,null,"0913118001",16000,"Collectivité"]
["COUIZA - MONTAZEL (11)","11919",null,null,null,null,null,null,"0911103001",3000,"Collectivité"]
["COURLAOUX - VAL DE SORNE (39)","39952",null,null,null,null,null,null,"0939171001",3700,"Collectivité"]
["COURNONTERRAL (34)","34926",null,null,null,null,null,null,"0934088001",7200,"Collectivité"]
["COURSAN (11)","11966",null,null,null,null,null,null,"0911106001",9000,"Collectivité"]
["COURZIEU (69)","69929",null,null,null,null,null,null,"0969067001",2200,"Collectivité"]
["COUSANCE (39)","39173",null,null,null,null,null,null,"0939173001",6000,"Collectivité"]
["CRECHES SUR SAONE (71)","71150",null,null,null,null,null,null,"0971150001",8000,"Collectivité"]
["CREST (26)","26802","Entrée station","Sortie station",null,null,null,null,"0926108001",19000,"Collectivité"]
["CREYS MEPIEU LA FOUILLOUSE (38)","38810",null,null,null,null,null,null,"0938139008",2800,"Collectivité"]
["CRUAS (07)","07076",null,null,null,null,null,null,"0907076001",2700,"Collectivité"]
["CRUZY (34)","34092",null,null,null,null,null,null,"0934092001",2000,"Collectivité"]
["CTS (ST CLAUDE 39 )","17394G","Sortie station",null,null,null,null,null,null,null,"Industrie"]
["CUCURON (84)","84905",null,null,null,null,null,null,"0984042002",3000,"Collectivité"]
["CUERS (83)","83049",null,null,null,null,null,null,"0983049002",21000,"Collectivité"]
["CUGES LES PINS (13)","13931",null,null,null,null,null,null,"0913030002",3000,"Collectivité"]
["CUISEAUX (71)","71157",null,null,null,null,null,null,"0971157001",34000,"Collectivité"]
["CUISERY (71)","71158",null,null,null,null,null,null,"0971158003",7500,"Collectivité"]
["CULOZ (01)","01138",null,null,null,null,null,null,"0901138001",5000,"Collectivité"]
["CUSENIER SA (THUIR 66 )","17658U","Entrée station","Sortie station",null,null,null,null,null,null,"Industrie"]
["CUSSEY SUR L'OGNON (25)","25910",null,null,null,null,null,null,"0925186001",3600,"Collectivité"]
["CUXAC - CABARDES (11)","03629",null,null,null,null,null,null,"0911115001",2000,"Collectivité"]
["CUXAC D'AUDE (11)","11966",null,null,null,null,null,null,"0911116001",6000,"Collectivité"]
["DAMPARIS (39)","39189",null,null,null,null,null,null,"0939189001",4500,"Collectivité"]
["DAMPRICHARD (25)","25805",null,null,null,null,null,null,"0925193001",2400,"Collectivité"]
["DANFOSS MANEUROP SA (ANSE 69 )","41624U","Sortie station",null,null,null,null,null,null,null,"Industrie"]
["DANONE (ST JUST CHALEYSSIN 38)","27874","Entrée station","Sortie station","Entrée Commune",null,null,null,null,null,"Industrie","92-002"]
["DARNEY (88)","88124",null,null,null,null,null,null,"0988124001",26250,"Collectivité"]
["DASSAULT AVIATION ARGONAY (74)",null,null,null,null,null,null,null,null,null,"Collectivité"]
["DASSAULT AVIATION ARGONAY (74)",null,null,null,null,null,null,null,null,null,"Collectivité"]
["DECORAL (FEIGERES 74)","19107U","Sortie station",null,null,null,null,null,null,null,"Industrie"]
["DEGUSSA FLAVORS (GRASSE 06)","14417W","Eaux diluées","Eaux concentrées","Sortie station",null,null,null,null,null,"Industrie"]
["DELICHIPS (AUBAGNE 13)","31809A",null,null,null,null,null,null,null,null,"Industrie"]
["DELLE - GRANDVILLARD (90)","90916",null,null,null,null,null,null,"0990053001",22000,"Collectivité"]
["DENNEY (90)","90903",null,null,null,null,null,null,"0990034001",3200,"Collectivité"]
["DIE (26)","26113","Entrée station","Sortie station",null,null,null,null,"0926113001",32000,"Collectivité"]
["DIGNE (04)","04070",null,null,null,null,null,null,"0904070001",20000,"Collectivité"]
["DIJON (21)","21910","Entrée ST1","Entrée ST2","Sortie ST1","Sortie ST2",null,null,"0921231001",400000,"Collectivité"]
["DISTILLERIE COOP D'ARZENS (ARZENS 11)","14644",null,null,null,null,null,null,null,null,"Industrie","SRR-09002"]
["DIVONNE LES BAINS (01)","01990",null,null,null,null,null,null,"0901143001",15000,"Collectivité"]
["DOLE - RIVE DROITE-CHOISEY (39)","39198",null,null,null,null,null,null,"0939150003",34000,"Collectivité"]
["DOMBLANS (39)","39942",null,null,null,null,null,null,"0939199001",2800,"Collectivité"]
["DOMMARTIN - CHEF LIEU (69)","69076",null,null,null,null,null,null,"0969076002",2000,"Collectivité"]
["DOMMARTIN - LISSIEU (69)","69963",null,null,null,null,null,null,"0969076003",3000,"Collectivité"]
["DONZERE (26)","26116","Entrée station","Sortie station","By-pass",null,null,null,"0926116001",18500,"Collectivité"]
["DOR-X (PONTARLIER 25)","15803C","Sortie station",null,null,null,null,null,null,null,"Industrie"]
["DOUVAINE BAS CHABLAIS (74)","74803",null,null,null,null,null,null,"0974105001",35000,"Collectivité"]
["DRACY LE FORT (71)","71929",null,null,null,null,null,null,"0971182001",4500,"Collectivité"]
["DRAP - VALLEE DU PAILLON (06)","06906",null,null,null,null,null,null,"0906054001",20000,"Collectivité"]
["DREVET S.A. (VOIRON 38)","17200W","Sortie station",null,null,null,null,null,null,null,"Industrie"]
["DUNG (25)","25996","Sortie station",null,null,null,null,null,"0925207001",2360,"Collectivité"]
["DUPONT (FAVERGES 74 )","19103P","Sortie station",null,null,null,null,null,null,null,"Industrie"]
["ECKES GRANINI (MACON 71)","64867",null,null,null,null,null,null,null,null,"Industrie","92-003"]
["ECKES GRANINI FRANCE (MACON 71)","64867H","Rejet général",null,null,null,null,null,null,null,"Industrie"]
["EDF CNPE DU TRICASTIN (ST PAUL LES 3 CHATEAUX 26)",null,null,"Sortie station",null,null,null,null,null,null,"Industrie"]
["EGUILLES (13)","13032",null,null,null,null,null,null,"0913032002",9000,"Collectivité"]
["ELCO BRANDT (LYON 69)","63386Y","Sortie station",null,null,null,null,null,null,null,"Industrie"]
["ELECTROLYSE PHOCEENNE (VITROLLES 13 )",null,"Sortie station",null,null,null,null,null,null,null,"Industrie"]
["ELNE (66)","66065",null,null,null,null,null,null,"0966065002",15000,"Collectivité"]
["EMBRUN BARATIER (05)","05912",null,null,null,null,null,null,"0905012001",30000,"Collectivité"]
["EMIN LEYDIER (SAINT VALLIER 26)","67382","MACHINE 5","MACHINE 6","Sortie station",null,null,null,null,null,"Industrie"]
["EMIN LEYDIER (SAINT VALLIER 26)","67383","Entrée station","Sortie station",null,null,null,null,null,null,"Industrie"]
["EMIN LEYDIER (ST VALLIER (CHAMPBLAIN) 26)","67382",null,null,null,null,null,null,null,null,"Industrie","00-006"]
["ENSUES LA REDONNE (13)","13939",null,null,null,null,null,null,"0913033002",3000,"Collectivité"]
["ENTRAIGUES SUR SORGUES (84)","84903",null,null,null,null,null,null,"0984043001",2000,"Collectivité"]
["ENTREMONT (ANNECY 74)","18966",null,null,null,null,null,null,null,null,"Industrie","SRR-09016"]
["ENTREMONT (MONTANGES 01 )","14208U","Entrée station","Sortie station",null,null,null,null,null,null,"Industrie"]
["ESPERAZA (11)","11129",null,null,null,null,null,null,"0911129001",5000,"Collectivité"]
["ESPINASSES ROUSSET (05)","05050",null,null,null,null,null,null,"0905050001",2000,"Collectivité"]
["ESPIRA DE L'AGLY (66)","66069",null,null,null,null,null,null,"0966069001",2700,"Collectivité"]
["ESSERT BAVILLIERS (90)","90903",null,null,null,null,null,null,"0990008001",15000,"Collectivité"]
["ESSO RAFFINAGE (EXXON MOBIL) (FOS 13)","14927",null,null,null,null,null,null,null,null,"Industrie","97-001"]
["ESSO RAFFINAGE SAF (FOS SUR MER 13)","14927A",null,"sortie biox","sortie lagune",null,null,null,null,null,"Industrie"]
["ESTAGEL (66)","66071",null,null,null,null,null,null,"0966071001",2100,"Collectivité"]
["ETALANS (25)","25222",null,null,null,null,null,null,"0925222001",3300,"Collectivité"]
["ETREZ ET LAITERIE (01)","01154",null,null,null,null,null,null,"0901154001",5900,"Collectivité"]
["EURECAT (VOULT 07 )","03587Z","Entrée station","Sortie station",null,null,null,null,null,null,"Industrie"]
["EURECAT (VOULT 07)","03587",null,null,null,null,null,null,null,null,"Industrie","SRR-12010"]
["EURENCO (SORGUES 84)","19740G","Rejet général",null,null,null,null,null,null,null,"Industrie"]
["EURENCO (SORGUES 84)","86279",null,null,null,null,null,null,null,null,"Industrie","88-018"]
["EURIDEP (GENLIS 21)","15435C","Sortie station",null,null,null,null,null,null,null,"Industrie"]
["EURIDEP (SIGMA COATING INDUSTRIES SA) (VALDOIE 90 )","36225A","Sortie station",null,null,null,null,null,null,null,"Industrie"]
["EURL PROVENCALE DE TRAITEMENTS D'EFFLUENTS (ST ALEXANDRE 30 )",null,"Entrée station","Sortie station",null,null,null,null,null,null,"Industrie"]
["EUROCOPTER (MARIGNANE 13)","14959",null,null,null,null,null,null,null,null,"Industrie","SRR-10010"]
["EUROPAGRO (VALENCE 26)","31469F","Rejet général",null,null,null,null,null,null,null,"Industrie"]
["EUROPEENNE D'EMBOUTEILLAGE (CHATEAUNEUF DE GADAGNE 84)","54306",null,null,null,null,null,null,null,null,"Industrie","SRR-"]
["EUROSERUM (PORT S/SAONE 70)","18500","Eaux de rinçage","Eaux acides","Sortie station","Saumures","Anioniques",null,null,null,"Industrie","94-001"]
["EUROSERUM (ST MARTIN BELLE ROCHE 71)","18685","Entrée station","Sortie station",null,null,null,null,null,null,"Industrie","SRR-08010"]
["EXPANSIA (ARAMON 30)","16104","Entrée station","Sortie station","Rejet Rhône",null,null,null,null,null,"Industrie","02-003"]
["EYDOCHE (38)","38159",null,null,null,null,null,null,"0938159001",2400,"Collectivité"]
["EYGUIERES (13)","13940",null,null,null,null,null,null,"0913035002",6000,"Collectivité"]
["EYRAGUES (13)","13036",null,null,null,null,null,null,"0913036002",5000,"Collectivité"]
["FABI (MORTEAU 25)","15764K","Sortie station",null,null,null,null,null,null,null,"Industrie"]
["FABREGUES (34)","34926",null,null,null,null,null,null,"0934095002",8100,"Collectivité"]
["FAUVERNEY (21)","21916",null,null,null,null,null,null,"0921261001",2000,"Collectivité"]
["FAYENCE - LES CLAUX (83)","83055",null,null,null,null,null,null,"0983055002",6000,"Collectivité"]
["FAYL - BILLOT (52)","52197",null,null,null,null,null,null,"0952197001",2700,"Collectivité"]
["FEILLENS (01)","01159",null,null,null,null,null,null,"0901159001",11300,"Collectivité"]
["FELINES (07)","07089",null,null,null,null,null,null,"0907089001",3000,"Collectivité"]
["FERNEY VOLTAIRE (01)","01990",null,null,null,null,null,null,"0901160001",14000,"Collectivité"]
["FETERNES (74)","72183",null,null,null,null,null,null,"0974127001",5200,"Collectivité"]
["FIGANIERES (83)","83056",null,null,null,null,null,null,"0983056001",2500,"Collectivité"]
["FINORGA (CHASSE SUR RHONE 38)","16844","Entrée station","Sortie station","Eaux refroidissement",null,null,null,null,null,"Industrie","93-004"]
["FITOU (11)","11144",null,"Entrée Port Fitou","Sortie station","Entrée station",null,null,"0911144001",2400,"Collectivité"]
["FLASSANS SUR ISSOLE (83)","83057",null,null,null,null,null,null,"0983057002",2900,"Collectivité"]
["FLAVIAC ROMPON (07)","07954",null,null,null,null,null,null,"0907090001",2800,"Collectivité"]
["FLAYOSC (83)","83058",null,null,null,null,null,null,"0983058002",7000,"Collectivité"]
["FLEURIEUX SUR L'ARBRESLE BUVET (69)","69981",null,null,null,null,null,null,"0969086003",9000,"Collectivité"]
["FLEURY - SAINT PIERRE (11)","11966",null,null,null,null,null,null,"0911145001",45000,"Collectivité"]
["FLEURY SALLES (11)","11966",null,null,null,null,null,null,"0911370002",6000,"Collectivité"]
["FLORENSAC (34)","34101",null,null,null,null,null,null,"0934101001",4000,"Collectivité"]
["FOISSIAT (01)","01163",null,null,null,null,null,null,"0901163002",2000,"Collectivité"]
["FONT ROMEU - ODEILLO-VIA (66)","66124",null,null,null,null,null,null,"0966124001",15000,"Collectivité"]
["FONTAINE DE VAUCLUSE (84)","84139",null,null,null,null,null,null,"0984139001",2000,"Collectivité"]
["FONTAINE LES LUXEUIL (70)","70240",null,null,null,null,null,null,"0970240001",2000,"Collectivité"]
["FONTAINES (71)","71202",null,null,null,null,null,null,"0971202001",2300,"Collectivité"]
["FONTAINES SUR SAONE (69)","69901","Entrée station","Sortie station","By-pass primaire",null,null,null,"0969088001",30000,"Collectivité"]
["FONTVIEILLE (13)","13038",null,null,null,null,null,null,"0913038002",5000,"Collectivité"]
["FORCALQUIER ESAINT (04)","04088",null,null,null,null,null,null,"0904088001",6000,"Collectivité"]
["FORCALQUIER OUESAINT (04)","04088",null,null,null,null,null,null,"0904088002",4000,"Collectivité"]
["FORMER (DELLE 90)","28679Y","Sortie station",null,null,null,null,null,null,null,"Industrie"]
["FORMER (GRANDVILLARDS 90)","29582E","Sortie station",null,null,null,null,null,null,null,"Industrie"]
["FORMIGUERES - LES ANGLES (66)","66961",null,null,null,null,null,null,"0966082003",15000,"Collectivité"]
["FOS SUR MER (13)","13903",null,null,null,null,null,null,"0913039003",22000,"Collectivité"]
["FOUCHERANS (39)","39233",null,null,null,null,null,null,"0939233002",4000,"Collectivité"]
["FOUGEROLLES (70)","70245",null,null,null,null,null,null,"0970245001",3700,"Collectivité"]
["FOULON SOPAGLY SAS (MACON 71)","86397",null,null,null,null,null,null,null,null,"Industrie","SRR-10022"]
["FOURQUES (30)","30117",null,null,null,null,null,null,"0930117002",4000,"Collectivité"]
["FRAISANS (39)","39235",null,null,null,null,null,null,"0939235001",2000,"Collectivité"]
["FRANCANO (TALMAY 21 )","28271E","Sortie station",null,null,null,null,null,null,null,"Industrie"]
["FREJUS - REYRAN (83)","83915","Entrée station","Sortie station",null,null,null,null,"0983061001",167000,"Collectivité"]
["FROMAGERIE DE CLERVAL (SANTOCHE 25)","15830",null,null,null,null,null,null,null,null,"Industrie","SRR-09023"]
["FROMAGERIE DE GRIEGES (PONT DE VEYLE 01)","14117V","Entrée station","Sortie station",null,null,null,null,null,null,"Industrie"]
["FROMAGERIE GUILLOTEAU (PELUSSIN 42)","27134U","Entrée station","Sortie station",null,null,null,null,null,null,"Industrie"]
["FROMAGERIE LEYMENT (LEYMENT 01)","14136R","Entrée station","Sortie station",null,null,null,null,null,null,"Industrie"]
["FRONTENEX (73)","73933",null,null,null,null,null,null,"0973121002",2500,"Collectivité"]
["FRONTIGNAN (34)","34992",null,null,null,null,null,null,"0934108001",8800,"Collectivité"]
["FRUITIERE DOMESSIN (DOMESSIN 74 )","29725K","Entrée station","Sortie station",null,null,null,null,null,null,"Industrie"]
["FRUIVAL (PORTES LES VALENCE 26)",null,null,null,null,null,null,null,null,null,"Industrie"]
["FRUPREP FRANCE (APT 84)","87057",null,null,null,null,null,null,null,null,"Industrie","SRR-"]
["FUISSE (71)","71210",null,null,null,null,null,null,"0971210001",6700,"Collectivité"]
["FUVEAU - GREASQUE (13)","13938",null,null,null,null,null,null,"0913040001",12000,"Collectivité"]
["G.E.P.E.I.F. (SAINT FONS 69)","22205Y","Eaux COURLY","Sortie station",null,null,null,null,null,null,"Industrie"]
["GABRIEL MEFFRE","19654N","Entrée station","Sortie station",null,null,null,null,null,null,"Industrie"]
["GAJAN (30)","30939",null,null,null,null,null,null,"0930122002",3500,"Collectivité"]
["GALERIA (20)","20121",null,null,null,null,null,null,"0920121001",3000,"Collectivité"]
["GALLARGUES LE MONTUEUX (30)","30123",null,null,null,null,null,null,"0930123002",5000,"Collectivité"]
["GALVANOPLAST (LURE 70)","18382",null,null,null,null,null,null,null,null,"Industrie","SRR-11009"]
["GANGES (34)","34111",null,null,null,null,null,null,"0934111001",6000,"Collectivité"]
["GAP (04)","05061","Entrée station","Sortie station","By-pass",null,null,null,"0905061001",54000,"Collectivité"]
["GARDANNE (13)","13041",null,null,null,null,null,null,"0913041001",50000,"Collectivité"]
["GARDONNENQUE (CRUVIERS LASCOURS 30)","16165W","Rejet général",null,null,null,null,null,null,null,"Industrie"]
["GARONS (30)","30817",null,null,null,null,null,null,"0930125002",4500,"Collectivité"]
["GATEFOSSE (ST PRIEST 69)","18344P",null,null,null,null,null,null,null,null,"Industrie"]
["GENLIS (21)","21292",null,null,null,null,null,null,"0921292001",7200,"Collectivité"]
["GEPEIF (ST FONS 69)","22205",null,null,null,null,null,null,null,null,"Industrie","88-005"]
["GEVIGNEY ET MERCEY (70)","70267",null,null,null,null,null,null,"0970267002",2000,"Collectivité"]
["GEVREY CHAMBERTIN (21)","21805",null,null,null,null,null,null,"0921295001",38000,"Collectivité"]
["GHISONACCIA (20)","20123",null,null,null,null,null,null,"0920123002",15000,"Collectivité"]
["GIE CHIMIE SALINDRES (SALINDRES 30)","60026W","Sortie station","Rejet usine",null,null,null,null,null,null,"Industrie"]
["GIE CHIMIE SALINDRES (SALINDRES 30)","60026",null,null,null,null,null,null,null,null,"Industrie","SRR-10006"]
["GIGEAN (34)","34992",null,null,null,null,null,null,"0934113002",6000,"Collectivité"]
["GIGNAC (34)","34114",null,null,null,null,null,null,"0934114002",8000,"Collectivité"]
["GIGNAC (34)",null,null,null,null,null,null,null,"0934114001",5000,"Collectivité"]
["GILLY SUR ISERE - ALBERTVILLE (73)","73936",null,null,null,null,null,null,"0973124001",32000,"Collectivité"]
["GIROMAGNY (90)","90927",null,null,null,null,null,null,"0990052002",9400,"Collectivité"]
["GIVAUDAN FRANCE FRAGRANCES (LYON 69)","17862R","Rejet usine",null,null,null,null,null,null,null,"Industrie"]
["GIVAUDAN LAVIROTTE (LYON 69)","17861","Rejet usine",null,null,null,null,null,null,null,"Industrie","94-005"]
["GIVORS (69)","69952","Entrée station","Sortie station","By-pass",null,null,null,"0969091001",90000,"Collectivité"]
["GIVRY (71)","71221",null,null,null,null,null,null,"0971221001",3700,"Collectivité"]
["GONFARON (83)","83067",null,null,null,null,null,null,"0983067002",3000,"Collectivité"]
["GRAND COMBE CHATELEU LES GRAS (25)","25948",null,null,null,null,null,null,"0925285001",2400,"Collectivité"]
["GRANDFONTAINE (25)","25958","Entrée station","Sortie station",null,null,null,null,"0925287001",9000,"Collectivité"]
["GRANS (13)","13903",null,null,null,null,null,null,"0913044002",3500,"Collectivité"]
["GRAPHOCOLOR (ANNECY 74)","18941","Sortie station",null,null,null,null,null,null,null,"Industrie","SRR-12001"]
["GRAP'SUD (SCA LA GARDONNENQUE) (CRUVIERS LASCOURS 30)","87986",null,null,null,null,null,null,null,null,"Industrie","SRR-09001"]
["GRASSE - LA PAOUTE (06)","06069","Entrée Urbain","Entrée Indus","Sortie Urbain","Sortie Indus","By-pass indus",null,"0906069003",50000,"Collectivité"]
["GRASSE - MARIGARDE (06)","06069",null,null,null,null,null,null,"0906069001",16000,"Collectivité"]
["GRASSE - ROUMIGUIERES (06)","06069",null,null,null,null,null,null,"0906069002",24000,"Collectivité"]
["GRAVESON (13)","13045",null,null,null,null,null,null,"0913045002",3300,"Collectivité"]
["GRAY (70)","70930",null,null,null,null,null,null,"0970279001",21000,"Collectivité"]
["GRENOBLE - AGGLOMERATION (38)","38961","Entrée station","Sortie station","By-pass",null,null,null,"0938170002",490000,"Collectivité"]
["GRENOBLE - LE FONTANIL (38)","38961","Entrée station","Sortie station",null,null,null,null,"0938170001",38000,"Collectivité"]
["GREOUX LES BAINS (04)","04094",null,null,null,null,null,null,"0904094002",20000,"Collectivité"]
["GRESSE EN VERCORS - AVAL (38)","38186",null,null,null,null,null,null,"0938186002",2800,"Collectivité"]
["GRILLON (84)","84053",null,null,null,null,null,null,"0984053001",3800,"Collectivité"]
["GRIMAUD (83)","83068","Entrée station","Sortie station",null,null,null,null,"0983068004",45000,"Collectivité"]
["GROSPIERRES (07)","10025",null,null,null,null,null,null,"0907101001",2000,"Collectivité"]
["GRUISSAN (11)","11966",null,null,null,null,null,null,"0911170001",35000,"Collectivité"]
["GUILHERAND GRANGES (07)","07980",null,null,null,null,null,null,"0907102001",33000,"Collectivité"]
["GUILLESTRE (05)","05910",null,null,null,null,null,null,"0905065001",20000,"Collectivité"]
["HABERE POCHE (74)","74140","Sortie station",null,null,null,null,null,"0974140001",3500,"Collectivité"]
["HACER TS (CLUSES 74)","19050",null,null,null,null,null,null,null,null,"Industrie","SRR-"]
["HARIBO (MARSEILLE 13)","14973A","Entrée station","Sortie station",null,null,null,null,null,null,"Industrie"]
["HAUTEVILLE LOMPNES (01)","01185",null,null,null,null,null,null,"0901185001",5400,"Collectivité"]
["HEINEKEN ENTREPRISE SA (MARSEILLE 13)","14989",null,"Sortie station",null,null,null,null,null,null,"Industrie","SRR-09018"]
["HEREPIAN (34)","34119",null,null,null,null,null,null,"0934119001",2400,"Collectivité"]
["HERICOURT (70)","70285",null,null,null,null,null,null,"0970285001",18300,"Collectivité"]
["HERO France S.A. (ALLEX 26)","28458H","Entrée station","Sortie station",null,null,null,null,null,null,"Industrie"]
["HOTONNES (01)","01187",null,null,null,null,null,null,"0901187001",2300,"Collectivité"]
["HYERES - L'ALMANARRE (83)","83922","Entrée Bio","Sortie Physico","Sortie station",null,null,null,"0983069001",91000,"Collectivité"]
["HYERES - PORQUEROLLES (83)","83069",null,null,null,null,null,null,"0983069002",4300,"Collectivité"]
["IBE TEXTILES COLOR (BEAUMONT LES VALENCE 26)","77442",null,null,null,null,null,null,null,null,"Industrie","SRR-11005"]
["ILLE SUR TET (66)","66088",null,null,null,null,null,null,"0966088001",7500,"Collectivité"]
["INEOS MANUFACTURING FRANCE SAS (LAVERA 13)","43452",null,null,null,null,null,null,null,null,"Industrie","98-003"]
["INOPLAST (ST DESIRAT 07 )","19888T","Sortie station",null,null,null,null,null,null,null,"Industrie"]
["INTERCOM. MONTBLANC-VALROS (34)","34900",null,null,null,null,null,null,"0934166003",7000,"Collectivité"]
["IRISBUS FRANCE (ANNONAY 07 )","14500L","Rejet général",null,null,null,null,null,null,null,"Industrie"]
["IS SUR TILLE - MARCILLY (21)","21944",null,null,null,null,null,null,"0921317001",9900,"Collectivité"]
["ISLE SUR LE DOUBS (25)","25315",null,null,null,null,null,null,"0925315001",3200,"Collectivité"]
["ISOLA 2000 (06)","06073",null,null,null,null,null,null,"0906073001",8000,"Collectivité"]
["ISTRES - ENTRESSEN G.CHENE (13)","13903",null,null,null,null,null,null,"0913047002",5000,"Collectivité"]
["ISTRES - RASSUEN (13)","13903","Entrée station","Sortie station",null,null,null,null,"0913047005",50000,"Collectivité"]
["IZEAUX SILLANS (38)","38962",null,null,null,null,null,null,"0938194001",2200,"Collectivité"]
["IZERNORE (01)","01192","Sortie station",null,null,null,null,null,"0901192002",2500,"Collectivité"]
["JACOB DELAFOND (DAMPARIS 39 )","17265S","Entrée station","Sortie station",null,null,null,null,null,null,"Industrie"]
["JASSANS RIOTTIER (01)","01194",null,null,null,null,null,null,"0901194002",11300,"Collectivité"]
["JEAN RIEUX (BIZE MINERVOIS 11)",null,null,null,null,null,null,null,null,null,"Industrie"]
["JONAGE (69)","69901",null,null,null,null,null,null,"0969279001",42000,"Collectivité"]
["JONQUERETTES - CHEF LIEU (84)","84943",null,null,null,null,null,null,"0984055002",2100,"Collectivité"]
["JONQUIERES (84)","84056",null,null,null,null,null,null,"0984056002",6100,"Collectivité"]
["JONQUIERES ET SAINT VINCENT (30)","30135",null,null,null,null,null,null,"0930135001",3500,"Collectivité"]
["JOUGNE (25)","25923","Sortie station",null,null,null,null,null,"0925318001",4400,"Collectivité"]
["JOUQUES (13)",null,null,null,null,null,null,null,"0913048001",3600,"Collectivité"]
["JOYEUSE (07)","10025",null,null,null,null,null,null,"0907110002",3500,"Collectivité"]
["JULIEN MACK (COUCHEY 21)",null,null,null,null,null,null,null,null,null,"Industrie"]
["JUSSEY (70)","70292",null,null,null,null,null,null,"0970292001",2100,"Collectivité"]
["JUSTIN BRIDOU S.N.C. (MACLAS 42)","46646C","Entrée station","Sortie station",null,null,null,null,null,null,"Industrie"]
["KEM ONE (BALAN 01)","95509",null,null,null,null,null,null,null,null,"Industrie","02-004"]
["KEM ONE (FOS SUR MER 13)","95503",null,null,null,null,null,null,null,null,"Industrie","SRR-11014"]
["KEM ONE (ST FONS 69)","95513",null,null,null,null,null,null,null,null,"Industrie","97-002"]
["KERRY FLAVOURS (GRASSE 06)","93825",null,null,null,null,null,null,null,null,"Industrie","00-002"]
["KERRY INGREDIENTS FRANCE- RAVIFRUIT (Lieu dit LES CLAVETTES (BOUGE CHAMBALUD)\nBOUGE CHAMBALUD 38 )","32180D","Entrée station","Sortie station",null,null,null,null,null,null,"Industrie"]
["KODAK INDUSTRIES (CHALON 71)","54578Z","Rejet usine",null,null,null,null,null,null,null,"Industrie"]
["LA BALME DE SILLINGY (74)","74925",null,null,null,null,null,null,"0974026001",3000,"Collectivité"]
["LA BATHIE VERNAYS (73)","73032",null,null,null,null,null,null,"0973032003",8000,"Collectivité"]
["LA BEGUDE (07)","10025",null,null,null,null,null,null,"0907116001",2000,"Collectivité"]
["LA BELLE CHAURIENNE (CASTELNAUDARY 11)","14689S","Entrée station","Sortie station",null,null,null,null,null,null,"Industrie"]
["LA BRESSE (01)","14147",null,null,null,null,null,null,"0901246800",15000,"Collectivité"]
["LA BRESSE (MEZERIAT 01)","14147C",null,null,null,null,null,null,null,null,"Industrie"]
["LA BRIDOIRE AIGUEBELETTE (73)","73928",null,null,null,null,null,null,"0973058003",13300,"Collectivité"]
["LA CABANASSE (66)","66913",null,null,null,null,null,null,"0966188001",6000,"Collectivité"]
["LA CALMETTE (30)","30817",null,null,null,null,null,null,"0930061002",2500,"Collectivité"]
["LA CHAPELLE D'ABONDANCE - CHATEL (74)","74941",null,null,null,null,null,null,"0974058001",12600,"Collectivité"]
["LA CHAPELLE EN VERCORS (26)","26947",null,null,null,null,null,null,"0926074002",2400,"Collectivité"]
["LA CHAPELLE SOUS ROUGEMONT (90)","90914",null,null,null,null,null,null,"0990058002",3000,"Collectivité"]
["LA CIOTAT (13)","13939","Entrée station","Sortie station",null,null,null,null,"0913028001",95000,"Collectivité"]
["LA COTE SAINT ANDRE - CHARPILLATES (38)","38920",null,null,null,null,null,null,"0938130002",9700,"Collectivité"]
["LA COTE SAINT ANDRE LE RIVAL (38)","38920",null,null,null,null,null,null,"0938130001",6500,"Collectivité"]
["LA FARE LES OLIVIERS (13)","13940",null,null,null,null,null,null,"0913037001",7400,"Collectivité"]
["LA FRANQUI (11)","11202",null,null,null,null,null,null,"0911202003",2000,"Collectivité"]
["LA GARDE FREINET (83)","83063",null,null,null,null,null,null,"0983063001",3000,"Collectivité"]
["LA GAUDE THUILLIERE (06)","06953",null,null,null,null,null,null,"0906065002",5000,"Collectivité"]
["LA GRAND COMBE HAUT GARDON (30)","30815",null,null,null,null,null,null,"0930132001",15000,"Collectivité"]
["LA GRANDE MOTTE (34)","34910",null,null,null,null,null,null,"0934344001",110000,"Collectivité"]
["LA LECHERE AIGUEBLANCHE (73)","73902",null,null,null,null,null,null,"0973187004",19800,"Collectivité"]
["LA LONDE LES MAURES - VALCROS (83)","33525",null,null,null,null,null,null,"0983071002",6000,"Collectivité"]
["LA LONDE LES MAURES (83)","83071",null,null,null,null,null,null,"0983071001",40000,"Collectivité"]
["LA MESTA CHIMIE FINE (GILETTE 06)","14393",null,null,null,null,null,null,null,null,"Industrie","05-002"]
["LA MOTTE CHALANCON (26)","26215",null,null,null,null,null,null,"0926215001",3000,"Collectivité"]
["LA NOUVELLE PAPETERIE GORGE DE DOMENE (DOMENE 38)","65275B","Entrée station","Sortie station",null,null,null,null,null,null,"Industrie"]
["LA PALME (11)","11188",null,null,null,null,null,null,"0911188002",2500,"Collectivité"]
["LA ROCHE DE GLUN (26)","26921",null,null,null,null,null,null,"0926271001",8000,"Collectivité"]
["LA ROCHE DE GLUN (26)",null,"Entrée station","Sortie station",null,null,null,null,null,null,"Collectivité"]
["LA ROQUE D'ANTHERON (13)","13084",null,null,null,null,null,null,"0913084001",6000,"Collectivité"]
["LA ROQUEBRUSSANNE (83)","83108",null,null,null,null,null,null,"0983108002",2500,"Collectivité"]
["LA SAULCE - INTERCOMMUNALE (05)","05916",null,null,null,null,null,null,"0905162002",2500,"Collectivité"]
["LA TOUR D'AIGUES (84)","84905",null,null,null,null,null,null,"0984133001",3900,"Collectivité"]
["LA TURBIE MONACO (06)","06910",null,null,null,null,null,null,"0906150001",4000,"Collectivité"]
["LA VAROISE (LA CRAU 83)","19362W",null,null,null,null,null,null,null,null,"Industrie"]
["LABIOMAR (SIGNES 83)","33496J","Entrée station","Sortie station",null,null,null,null,null,null,"Industrie"]
["LABO ET SERVICES KODAK (VITROLLES 13)",null,"Rejet usine",null,null,null,null,null,null,null,"Industrie"]
["LALOUVESC (07)","07128",null,null,null,null,null,null,"0907128001",4000,"Collectivité"]
["LAMALOU LES BAINS (34)","34126",null,null,null,null,null,null,"0934126001",3300,"Collectivité"]
["LAMANON (13)","13940",null,null,null,null,null,null,"0913049001",2800,"Collectivité"]
["LAMASTRE (07)","07129",null,null,null,null,null,null,"0907129001",5000,"Collectivité"]
["LAMBESC - STATION NORD (13)","13050",null,null,null,null,null,null,"0913050001",5000,"Collectivité"]
["LAMBESC - STATION SUD (13)","13050",null,null,null,null,null,null,"0913050002",2000,"Collectivité"]
["LANCIE (69)","69108",null,null,null,null,null,null,"0969108002",5300,"Collectivité"]
["LANCON EN PROVENCE - CHEF LIEU (13)","13940",null,null,null,null,null,null,"0913051001",9000,"Collectivité"]
["LANSARGUES (34)","34910",null,null,null,null,null,null,"0934127001",3000,"Collectivité"]
["LANSLEBOURG - MONT CENIS SALET (73)","73994",null,null,null,null,null,null,"0973143001",16000,"Collectivité"]
["LANTENNE VERTIERE (25)","25326",null,null,null,null,null,null,"0925326001",2800,"Collectivité"]
["LAPALUD (84)","84064",null,null,null,null,null,null,"0984064001",2500,"Collectivité"]
["LARAGNE MONTEGLIN (05)","05070",null,null,null,null,null,null,"0905070002",4500,"Collectivité"]
["L'ARBRESLE (69)","69984",null,null,null,null,null,null,"0969010001",7200,"Collectivité"]
["LARGENTIERE (07)","10025",null,null,null,null,null,null,"0907132001",3000,"Collectivité"]
["L'ARGENTIERE LA BESSEE (05)","05911",null,null,null,null,null,null,"0905006001",3000,"Collectivité"]
["LASALLE (30)","30140",null,null,null,null,null,null,"0930140001",3000,"Collectivité"]
["LATOUR DE CAROL ENVEIGT (66)","66908",null,null,null,null,null,null,"0966095001",2700,"Collectivité"]
["LATOUR DE FRANCE (66)","66096",null,null,null,null,null,null,"0966096002",2000,"Collectivité"]
["LATTES - CHEF LIEU (34)",null,null,null,null,null,null,null,"0934129002",7500,"Collectivité"]
["LATTES MAURIN (34)",null,null,null,null,null,null,null,"0934129001",3500,"Collectivité"]
["LAUDUN L'ARDOISE (30)","30141",null,null,null,null,null,null,"0930141003",3800,"Collectivité"]
["LAUDUN VILLAGE (30)","30141",null,null,null,null,null,null,"0930141001",6400,"Collectivité"]
["LAURENS (34)","34130",null,null,null,null,null,null,"0934130001",2000,"Collectivité"]
["LAURIS (84)","84905",null,null,null,null,null,null,"0984065001",3000,"Collectivité"]
["LAVANDOU - LE RAYOL CANADEL (83)","83926",null,null,null,null,null,null,"0983070001",17300,"Collectivité"]
["LAVANS LES SAINT CLAUDE (39)","39286",null,null,null,null,null,null,"0939286001",2300,"Collectivité"]
["LAVASUD (Gignac LA NERTHE 13 )","33567L","Entrée station","Sortie station",null,null,null,null,null,null,"Industrie"]
["LAVAU MOURET ","58407L","Entrée station","Sortie station",null,null,null,null,null,null,"Industrie"]
["LAVERUNE L'EMBARONIERE (34)","34926",null,null,null,null,null,null,"0934134003",5000,"Collectivité"]
["LAVIGNY (39)","39970",null,null,null,null,null,null,"0939288001",3700,"Collectivité"]
["LAYE - HAMEAUX (05)","05072",null,null,null,null,null,null,"0905072001",2000,"Collectivité"]
["LDC BOURGOGNE (BRANGES 71)","10787",null,null,null,null,null,null,null,null,"Industrie","SRR-09015"]
["LE BAR SUR LOUP (06)","06010",null,null,null,null,null,null,"0906010002",4000,"Collectivité"]
["LE BARCARES (66)","66966","Entrée station","Sortie biologique","Sortie Lagune","By-pass",null,null,"0966017001",57000,"Collectivité"]
["LE BOIS MOUTIERS SALINS (73)","73919",null,null,null,null,null,null,"0973045001",47000,"Collectivité"]
["LE BOULOU (66)","66024",null,null,null,null,null,null,"0966024002",11000,"Collectivité"]
["LE BOURG D'OISANS - HUEZ (38)","38808","Entrée station","Sortie station",null,null,null,null,"0938052001",69000,"Collectivité"]
["LE BOUSQUET D'ORB - LUNAS (34)","34944",null,null,null,null,null,null,"0934038002",3100,"Collectivité"]
["LE CAILAR (30)","30059",null,null,null,null,null,null,"0930059001",2500,"Collectivité"]
["LE CANNET DES MAURES (83)","83031",null,null,null,null,null,null,"0983031002",3400,"Collectivité"]
["LE CHEYLARD (07)","07968",null,null,null,null,null,null,"0907064005",23000,"Collectivité"]
["LE GRAU DU ROI (30)","30816",null,null,null,null,null,null,"0930133002",100000,"Collectivité"]
["LE LUC - PAYETTE (83)","83073",null,null,null,null,null,null,"0983073003",10000,"Collectivité"]
["LE MUY (83)","83086",null,null,null,null,null,null,"0983086002",10000,"Collectivité"]
["LE PLAN D'ORGON (13)","13076",null,null,null,null,null,null,"0913076003",3500,"Collectivité"]
["LE POET LAVAL DIEULEFIT (26)","26950",null,null,null,null,null,null,"0926243001",3600,"Collectivité"]
["LE ROVE CHEF LIEU (13)","13939",null,null,null,null,null,null,"0913088003",4000,"Collectivité"]
["LE RUSSEY (25)","25512",null,null,null,null,null,null,"0925512001",3100,"Collectivité"]
["LE TEIL D'ARDECHE BARCASSE (07)","07319",null,null,null,null,null,null,"0907319002",7500,"Collectivité"]
["LE THOR (84)","84132",null,null,null,null,null,null,"0984132002",8000,"Collectivité"]
["LE THORONET (83)","83136",null,null,null,null,null,null,"0983136002",2000,"Collectivité"]
["LE VAL (83)","83143",null,null,null,null,null,null,"0983143002",3000,"Collectivité"]
["LE VIGAN (30)","30949",null,null,null,null,null,null,"0930350001",13500,"Collectivité"]
["LEGRE MANTE (MARSEILLE 13)","15020B",null,null,null,null,null,null,null,null,"Industrie"]
["LELEX (01)","01990",null,null,null,null,null,null,"0901210002",2000,"Collectivité"]
["LES ABRETS (38)","38905",null,null,null,null,null,null,"0938001001",2900,"Collectivité"]
["LES ANGLES - MATEMALE (66)","66919",null,null,null,null,null,null,"0966004001",4000,"Collectivité"]
["LES ARCS (83)","83004",null,null,null,null,null,null,"0983004001",5100,"Collectivité"]
["LES AVENIERES LES NAPPES (38)","38905",null,null,null,null,null,null,"0938022002",12000,"Collectivité"]
["LES BAUX - PARADOU (13)","13905",null,null,null,null,null,null,"0913058003",4000,"Collectivité"]
["LES CHAIS BEAUCAIROIS (BEAUCAIRE 30)","16123A","Entrée station","Sortie station",null,null,null,null,null,null,"Industrie"]
["LES DESERTS LA FECLAZ (73)","73098",null,null,null,null,null,null,"0973098001",2300,"Collectivité"]
["LES GETS (74)","74134",null,null,null,null,null,null,"0974134001",7500,"Collectivité"]
["LES HOUCHES - CHAMONIX (74)","74953",null,null,null,null,null,null,"0974143002",65000,"Collectivité"]
["LES HOUCHES SERVOZ (74)","74953",null,null,null,null,null,null,"0974143001",2500,"Collectivité"]
["LES LONGEVILLES MONT D'OR (25)","25923",null,null,null,null,null,null,"0925361001",4100,"Collectivité"]
["LES MAGES (30)","30152",null,null,null,null,null,null,"0930152001",3500,"Collectivité"]
["LES MEES (04)","04116",null,null,null,null,null,null,"0904116001",2500,"Collectivité"]
["LES ORRES (05)","05912",null,null,null,null,null,null,"0905098001",10000,"Collectivité"]
["LES SALLES SUR VERDON (83)","83122",null,null,null,null,null,null,"0983122001",3000,"Collectivité"]
["LES VANS (07)","07334",null,null,null,null,null,null,"0907334001",5100,"Collectivité"]
["LES VIGNEAUX (05)","05911",null,null,null,null,null,null,"0905180001",2000,"Collectivité"]
["L'ESCARENE (06)","06057",null,null,null,null,null,null,"0906057001",4000,"Collectivité"]
["LESPIGNAN (34)","34135",null,null,null,null,null,null,"0934135002",2700,"Collectivité"]
["LEUCATE - VILLAGE (11)","11202",null,null,null,null,null,null,"0911202002",13000,"Collectivité"]
["LEUCATE PORT (11)","11202",null,null,null,null,null,null,"0911202001",45000,"Collectivité"]
["LEVENS - VILLAGE-CUMBA (06)","06953",null,null,null,null,null,null,"0906075001",3000,"Collectivité"]
["LEVIE (20)","20142",null,null,null,null,null,null,"0920142002",2500,"Collectivité"]
["LEVIER (25)","25334",null,null,null,null,null,null,"0925334001",3200,"Collectivité"]
["LEZIGNAN CORBIERES (11)","11203",null,null,null,null,null,null,"0911203001",10000,"Collectivité"]
["LIERGUES PONT DE SOLLIERES (69)",null,null,null,null,null,null,null,"0969114001",2300,"Collectivité"]
["LIGNAN SUR ORB (34)","34988",null,null,null,null,null,null,"0934140001",6000,"Collectivité"]
["LIMONEST (69)","69901",null,null,null,null,null,null,"0969116001",3300,"Collectivité"]
["LIMOUX (11)","11206",null,null,null,null,null,null,"0911206001",15000,"Collectivité"]
["LINGUIZZETTA BRAVONE PLAINE (20)","20143",null,null,null,null,null,null,"0920143002",8000,"Collectivité"]
["LISI AUTOMOTIVE FORMER (GRANDVILLARS 90)","29582",null,null,null,null,null,null,null,null,"Industrie","SRR-12008"]
["L'ISLE D'ABEAU 238) (38)","38928","Entrée station","Sortie nord","Sortie sud","By pass",null,null,"0938449001",90000,"Collectivité"]
["L'ISLE SUR SORGUES (84)","84054",null,null,null,null,null,null,"0984054004",70000,"Collectivité"]
["LIVRON (26)","26165","Entrée station","Sortie station",null,null,null,null,"0926165001",5000,"Collectivité"]
["LODEVE (34)","34142",null,null,null,null,null,null,"0934142001",13300,"Collectivité"]
["LONS LE SAUNIER (39)","39952","Entrée station","Sortie station","By-pass",null,null,null,"0939362001",44000,"Collectivité"]
["LOR (PERPIGNAN 66)",null,null,null,null,null,null,null,null,null,"Industrie"]
["LORGUES - CHEF LIEU (83)","83072",null,null,null,null,null,null,"0983072001",7000,"Collectivité"]
["LORIOL (26)","26166","Entrée station","Sortie station","Surverse BO",null,null,null,"0926166002",12000,"Collectivité"]
["LOUHANS (71)","71263",null,null,null,null,null,null,"0971263001",26000,"Collectivité"]
["LOUIS MARTIN (MONTEUX 84)","85044",null,null,null,null,null,null,null,null,"Industrie","SRR-11003"]
["LOURMARIN (84)","84068",null,null,null,null,null,null,"0984068002",3000,"Collectivité"]
["LUCENAY (69)","69122",null,null,null,null,null,null,"0969122001",3300,"Collectivité"]
["LUGNY - SAINT OYEN MONTBELLET (71)","71933",null,null,null,null,null,null,"0971267001",4600,"Collectivité"]
["LUMBIN LA TERRASSE (38)","38951",null,null,null,null,null,null,"0938214001",4000,"Collectivité"]
["LUMIO SANT AMBROGIO (20)","20150",null,null,null,null,null,null,"0920150002",6000,"Collectivité"]
["LUNEL (34)","34145",null,null,null,null,null,null,"0934145001",33000,"Collectivité"]
["LUNEL VIEL (34)","34146",null,null,null,null,null,null,"0934146002",3000,"Collectivité"]
["LURE (70)","70810",null,null,null,null,null,null,"0970310002",20000,"Collectivité"]
["LUSTUCRU (LORETTE 42)",null,null,null,null,null,null,null,null,null,"Industrie"]
["LUXEUIL LES BAINS (70)","70823",null,null,null,null,null,null,"0970311001",20000,"Collectivité"]
["LYON - PIERRE BENITE (69)","69901","Entrée station","Sortie biologique","By-pass",null,null,null,"0969152001",950000,"Collectivité"]
["LYON - SAINT FONS (69)","69901","Entrée station","Entrée station",null,null,null,null,"0969199001",1037000,"Collectivité"]
["LYONDELL (FOS 13)","28497","Entrée station","Sortie station","Rejet Darse",null,null,null,null,null,"Industrie","00-009"]
["MACON (70)","71969","Entrée ZIS","Entrée VC10","Sortie station","Sortie BO",null,null,"0971270001",148000,"Collectivité"]
["MAGALAS (34)","34147",null,null,null,null,null,null,"0934147001",3500,"Collectivité"]
["MAGNY SUR TILLE (21)","21916",null,null,null,null,null,null,"0921370001",2000,"Collectivité"]
["MAICHE (25)","25805",null,null,null,null,null,null,"0925356001",5200,"Collectivité"]
["MAILLANE (13)","13052",null,null,null,null,null,null,"0913052002",2700,"Collectivité"]
["MAJ ELIS RIVIERA (LE BROC 06)",null,null,null,null,null,null,null,null,null,"Industrie"]
["MALAUCENE (84)","84903",null,null,null,null,null,null,"0984069001",3000,"Collectivité"]
["MALIJAI (04)","04108",null,null,null,null,null,null,"0904108002",3000,"Collectivité"]
["MALISSARD (26)","26170",null,null,null,null,null,null,"0926170001",2300,"Collectivité"]
["MALLEMORT - CHEF-LIEU (13)","13940",null,null,null,null,null,null,"0913053001",3000,"Collectivité"]
["MALTERIE FRANCO BELGE (BRAZEY EN PLAINE 21)","15343","Entrée station","Sortie station",null,null,null,null,null,null,"Industrie","SRR-11015"]
["MAMIROLLE (25)","25364",null,null,null,null,null,null,"0925364001",3000,"Collectivité"]
["MANDUEL (30)","30817",null,null,null,null,null,null,"0930155002",9000,"Collectivité"]
["MANE ET FILS (BAR S/LOUP 06)","14350",null,null,null,null,null,null,null,null,"Industrie","88-011"]
["MANE ET FILS (LE BAR SUR LOUP 66)","14350Y","Entrée station","Sortie station",null,null,null,null,null,null,"Industrie"]
["MANOSQUE (04)","04112",null,null,null,null,null,null,"0904112001",30000,"Collectivité"]
["MARAUSSAN (34)","34148",null,null,null,null,null,null,"0934148002",5000,"Collectivité"]
["MARCILLAT LOULANS (LOULANS-VERCHAMPS 70)","54541J","Entrée station","Sortie station",null,null,null,null,null,null,"Industrie"]
["MARGUERITTES (30)","30817",null,null,null,null,null,null,"0930156002",15000,"Collectivité"]
["MARIGNANE - LA PALUN (13)","13939","Entrée 1","Entrée 2","Sortie station",null,null,null,"0913054002",70000,"Collectivité"]
["MARIGNY DOMAINE DE CHALAIN (39)","27727",null,null,null,null,null,null,"0939313002",4000,"Collectivité"]
["MARLENS CHAMPS FROIDS (74)","74925",null,null,null,null,null,null,"0974167001",10000,"Collectivité"]
["MARNAY (70)","70334",null,null,null,null,null,null,"0970334001",2100,"Collectivité"]
["MARSEILLAN - LES ONGLOUS (34)","34992",null,null,null,null,null,null,"0934150003",12500,"Collectivité"]
["MARSEILLAN LES PRADELS (34)","34992",null,null,null,null,null,null,"0934150004",32000,"Collectivité"]
["MARSEILLE - ILE DU FRIOUL (13)","13939",null,null,null,null,null,null,"0913055002",2000,"Collectivité"]
["MARSEILLE boues (13)","13939","Entrée Unitaire","Entrée Séparatif","Sortie",null,null,null,"0913055001",1630000,"Collectivité"]
["MARSEILLE eaux (13)","13939","Entrée Unitaire","Entrée Séparatif","Sortie",null,null,null,"0913055001",1630000,"Collectivité"]
["MARSILLARGUES (34)","34151",null,null,null,null,null,null,"0934151001",6600,"Collectivité"]
["MARTIGUES - PORT DE BOUC (13)","13941","Entrée station","Sortie station",null,null,null,null,"0913056003",100000,"Collectivité"]
["MARTINET (ST FALLAVIER 38)","36821","Entrée station","Sortie station",null,null,null,null,null,null,"Industrie","SRR-09010"]
["MASSIEUX - REYRIEUX - PARCIEUX (01)","01934",null,null,null,null,null,null,"0901238001",9000,"Collectivité"]
["MAT (CHESSY LES MINES 69)","77649","Entrée station","Sortie station",null,null,null,null,null,null,"Industrie","88-004"]
["MAUGUIO - BOURG (34)","34910",null,null,null,null,null,null,"0934154002",10800,"Collectivité"]
["MAUGUIO PLAGE - CARNON PEROLS (34)","34910",null,null,null,null,null,null,"0934154001",35000,"Collectivité"]
["MAUREILHAN (34)","34155",null,null,null,null,null,null,"0934155001",2500,"Collectivité"]
["MAUREILLAS LAS ILLAS (66)","66106",null,null,null,null,null,null,"0966106004",3200,"Collectivité"]
["MAUSSANE LES ALPILLES (13)","13058",null,null,null,null,null,null,"0913058002",5500,"Collectivité"]
["MAZAN (84)","84072",null,null,null,null,null,null,"0984072002",6000,"Collectivité"]
["MEJANNES LE CLAP (30)","03636",null,null,null,null,null,null,"0930164001",2000,"Collectivité"]
["MELISEY SAINT BARTHELEMY (70)","70981",null,null,null,null,null,null,"0970339003",2300,"Collectivité"]
["MENTON (06)","06083","Entrée station","Sortie station",null,null,null,null,"0906083001",80000,"Collectivité"]
["MERCK SANTE (MEYZIEU 69)","18317","Entrée station","Sortie station",null,null,null,null,null,null,"Industrie","07-005"]
["MERCUREY (71)","71929",null,null,null,null,null,null,"0971294001",5400,"Collectivité"]
["MERIAL SAS (LYON 69)","17838",null,null,null,null,null,null,null,null,"Industrie","SRR-"]
["MERIAL SAS (SAINT PRIEST 69)","45028",null,null,null,null,null,null,null,null,"Industrie","SRR-12004"]
["MESSIMY - VALLEE DU GARON (69)","69957",null,null,null,null,null,null,"0969131002",12000,"Collectivité"]
["METABIEF (25)","25923",null,null,null,null,null,null,"0925380002",9000,"Collectivité"]
["MEUILLEY (21)","72794",null,null,null,null,null,null,"0921409001",6000,"Collectivité"]
["MEURSAULT (21)","21810",null,null,null,null,null,null,"0921412002",5400,"Collectivité"]
["MEXIMIEUX (01)","01244",null,null,null,null,null,null,"0901244001",13100,"Collectivité"]
["MEYNES (30)","30166",null,null,null,null,null,null,"0930166001",3000,"Collectivité"]
["MEYRARGUES (13)","13059",null,null,null,null,null,null,"0913059001",3000,"Collectivité"]
["MEYREUIL PONTET - CHEF LIEU (13)","13060",null,null,null,null,null,null,"0913060004",4000,"Collectivité"]
["MEYZIEU (69)","69901","Entrée station","Sortie Primaire","Sortie station",null,null,null,"0969282001",33000,"Collectivité"]
["MEZE (34)","34978",null,null,null,null,null,null,"0934157001",11700,"Collectivité"]
["MIALET (30)","30810",null,null,null,null,null,null,"0930168001",2000,"Collectivité"]
["MIEUSSY (74)","74183",null,null,null,null,null,null,"0974183001",2700,"Collectivité"]
["MIJOUX - CHEF LIEU (01)","01990",null,null,null,null,null,null,"0901247003",3000,"Collectivité"]
["MILHAUD (30)","30817",null,null,null,null,null,null,"0930169002",7000,"Collectivité"]
["MILLAS - LE BOLES (66)","66108",null,null,null,null,null,null,"0966108002",5000,"Collectivité"]
["MILLERET (CHARCENNE 70)","18391","Entrée station","Sortie station",null,null,null,null,null,null,"Industrie","SRR-09013"]
["MIONNAY (01)","01248",null,null,null,null,null,null,"0901248002",2000,"Collectivité"]
["MIREBEAU SUR BEZE (21)","21416",null,null,null,null,null,null,"0921416001",2500,"Collectivité"]
["MIREPEISSET (11)","11233",null,null,null,null,null,null,"0911233001",2000,"Collectivité"]
["MIREVAL (34)","34992",null,null,null,null,null,null,"0934159002",4000,"Collectivité"]
["MITHIEUX (CHAMBERY 73)","18805R","Sortie station",null,null,null,null,null,null,null,"Industrie"]
["MIZERIEUX (01)","01814",null,null,null,null,null,null,"0901250002",2400,"Collectivité"]
["MOIRANS EN MONTAGNE (39)","39333","DO Entrée","Entrée","Sortie",null,null,null,"0939333001",2100,"Collectivité"]
["MOLIERES SUR CEZE (30)","30171",null,null,null,null,null,null,"0930171001",2000,"Collectivité"]
["MOLLEGES (13)","13904",null,null,null,null,null,null,"0913064001",2500,"Collectivité"]
["MONDRAGON (84)","84078",null,null,null,null,null,null,"0984078002",4000,"Collectivité"]
["MONDRAGON (84)",null,null,null,null,null,null,null,"0984078001",2000,"Collectivité"]
["MONNARD (ST AMOUR 39)","17383","Eaux de lavage Monnard","Condensats Monnard","Sortie station","Eaux de lavage Prodia","Condensats Prodia",null,null,null,"Industrie","91-002"]
["MONSOLS (69)","69135",null,null,null,null,null,null,"0969135001",21000,"Collectivité"]
["MONTADY (34)","34161",null,null,null,null,null,null,"0934161001",3600,"Collectivité"]
["MONTAGNAC (34)","34162",null,null,null,null,null,null,"0934162001",5000,"Collectivité"]
["MONTALIEU VERCIEU (38)","38942",null,null,null,null,null,null,"0938247001",4100,"Collectivité"]
["MONTARNAUD (34)","34163",null,null,null,null,null,null,"0934163002",4000,"Collectivité"]
["MONTAUROUX - CALLIAN (83)","77639",null,null,null,null,null,null,"0983081001",5700,"Collectivité"]
["MONTBAZIN (34)","34978",null,null,null,null,null,null,"0934165002",2300,"Collectivité"]
["MONTBLANC (34)",null,null,null,null,null,null,null,"0934166002",3300,"Collectivité"]
["MONTBONNOT SAINT MARTIN (38)",null,null,null,null,null,null,null,"0938249001",10800,"Collectivité"]
["MONTBONNOT SAINT MARTIN INOVALLEE (38)","38967",null,null,null,null,null,null,"0938249002",35000,"Collectivité"]
["MONTCLAR (04)","04126",null,null,null,null,null,null,"0904126001",2000,"Collectivité"]
["MONTELIMAR (26)","26198","Entrée station","Sortie station","By-pass",null,null,null,"0926198001",35000,"Collectivité"]
["MONTEUX (84)","84903",null,null,null,null,null,null,"0984080001",23600,"Collectivité"]
["MONTFRIN (30)","30179",null,null,null,null,null,null,"0930179002",5000,"Collectivité"]
["MONTGENEVRE (05)","05906",null,null,null,null,null,null,"0905085001",12000,"Collectivité"]
["MONTIGNY SUR AIN (39)","39991",null,null,null,null,null,null,"0939356001",4200,"Collectivité"]
["MONTLUEL NIEVROZ (01)","01988",null,null,null,null,null,null,"0901262001",16200,"Collectivité"]
["MONTMELIAN (73)","73887",null,null,null,null,null,null,"0973171003",18000,"Collectivité"]
["MONTMERLE SUR SAONE (01)","01991",null,null,null,null,null,null,"0901263001",3800,"Collectivité"]
["MONTPELLIER (34)","34926","Entrée Séparatif","Entrée unitaire","Sortie Décanteur","Sortie 1","Sortie 2",null,"0934172001",470000,"Collectivité"]
["MONTREAL (11)","11254",null,null,null,null,null,null,"0911254002",3500,"Collectivité"]
["MONTREDON DES CORBIERES (11)","11966",null,null,null,null,null,null,"0911255002",2500,"Collectivité"]
["MONTREUX-CHATEAU (90)","90931",null,null,null,null,null,null,"0990071002",4000,"Collectivité"]
["MONTREVEL - JAYAT CESILLES (01)","01995",null,null,null,null,null,null,"0901196002",6000,"Collectivité"]
["MORANCE (69)","69140",null,null,null,null,null,null,"0969140002",5500,"Collectivité"]
["MORESTEL (38)","38261",null,null,null,null,null,null,"0938261001",4500,"Collectivité"]
["MOREZ (39)","39946",null,null,null,null,null,null,"0939368001",11700,"Collectivité"]
["MORIERES LES AVIGNON (84)","84943",null,null,null,null,null,null,"0984081001",12000,"Collectivité"]
["MORILLON SAMOENS VERCHAIX (74)","74909",null,null,null,null,null,null,"0974190001",8800,"Collectivité"]
["MORNAS (84)","84083",null,null,null,null,null,null,"0984083002",2700,"Collectivité"]
["MOROSAGLIA PONTE LECCIA (20)","20169",null,null,null,null,null,null,"0920169002",2500,"Collectivité"]
["MORTEAU (25)","25948",null,null,null,null,null,null,"0925411001",14000,"Collectivité"]
["MORZINE (74)","74938",null,null,null,null,null,null,"0974191002",24000,"Collectivité"]
["MOUANS SARTOUX (06)","06084",null,null,null,null,null,null,"0906084002",15400,"Collectivité"]
["MOUCHARD (39)","39370",null,null,null,null,null,null,"0939370001",2000,"Collectivité"]
["MOURIES (13)","13065",null,null,null,null,null,null,"0913065002",4000,"Collectivité"]
["MOUSSAN (11)","11966",null,null,null,null,null,null,"0911258001",2500,"Collectivité"]
["MOUSTIERS SAINTE MARIE (04)","04135",null,null,null,null,null,null,"0904135001",8000,"Collectivité"]
["MOUTHE (25)","25994",null,null,null,null,null,null,"0925263001",3500,"Collectivité"]
["MSSA (METAUX SPECIAUX) (ST MARCEL 73)","18902",null,null,null,null,null,null,null,null,"Industrie","SRR-09021"]
["MUDAISON (34)","34910",null,null,null,null,null,null,"0934176001",2700,"Collectivité"]
["MURVIEL LES BEZIERS (34)","34178",null,null,null,null,null,null,"0934178001",4000,"Collectivité"]
["NANS LES PINS (83)","83087",null,null,null,null,null,null,"0983087002",3500,"Collectivité"]
["NANTUA - PORT (01)","01817",null,null,null,null,null,null,"0901307001",7200,"Collectivité"]
["NAPHTACHIMIE (LAVERA 13)","15141","Eaux Chimiques  ","Sortie station","Rejet tunnel","Effluents tiers forte charge",null,null,null,null,"Industrie","88-008"]
["NARBONNE - PLAGE (11)","11966",null,null,null,null,null,null,"0911262003",26000,"Collectivité"]
["NARBONNE - VILLE (11)","11966","Entrée station","Sortie 1","Sortie 2","By-pass",null,null,"0911262001",120000,"Collectivité"]
["NATUREX SA (AVIGNON 84)","59369",null,null,null,null,null,null,null,null,"Industrie","SRR-09029"]
["NEFFES - PELLEAUTIER (05)","05915",null,null,null,null,null,null,"0905092001",2700,"Collectivité"]
["NESTLE FRANCE (MARSEILLE 13)",null,"Entrée station","Sortie station",null,null,null,null,null,null,"Industrie"]
["NEUVILLE SUR SAONE (69)","69901","Entrée station","Sortie station",null,null,null,null,"0969143001",18000,"Collectivité"]
["NEVACHE (05)","05906",null,null,null,null,null,null,"0905093001",2000,"Collectivité"]
["NEYDENS (74)","74917",null,null,null,null,null,null,"0974201001",6000,"Collectivité"]
["NEZIGNAN L'EVEQUE (34)","34182",null,null,null,null,null,null,"0934182002",2600,"Collectivité"]
["NICE (06)","06953","Entrée station","Sortie station",null,null,null,null,"0906088001",650000,"Collectivité"]
["NICKELAGE CHROMAGE (ANNECY 74 )","19259J","Sortie station",null,null,null,null,null,null,null,"Industrie"]
["NIMES CENTRE (30)","30817","Entrée","Sortie T1-T4","Sortie T5",null,null,null,"0930189001",109000,"Collectivité"]
["NIMES SUD-OUEST (30)","30817","Entrée station","Sortie station",null,null,null,null,"0930189002",91000,"Collectivité"]
["NISSAN LES ENSERUNE (34)","34183",null,null,null,null,null,null,"0934183001",12500,"Collectivité"]
["NOBLITEX (COURS LA VILLE 69)",null,"Rejet général",null,null,null,null,null,null,null,"Industrie"]
["NOLAY (21)","21810",null,null,null,null,null,null,"0921461001",2000,"Collectivité"]
["NOTRE DAME DE BELLECOMBE (73)","73186",null,null,null,null,null,null,"0973186001",3600,"Collectivité"]
["NOTRE DAME DE LA CRAU (83)","83917",null,null,null,null,null,null,"0983047001",50000,"Collectivité"]
["NOVES - CHEF-LIEU (13)","13904",null,null,null,null,null,null,"0913066003",4000,"Collectivité"]
["NOVES LES PALUDS - VERQUIERES (13)","13904",null,null,null,null,null,null,"0913066004",2000,"Collectivité"]
["NOVILLARS (25)",null,null,null,null,null,null,null,"0925429001",3300,"Collectivité"]
["NYONS (26)","26220","Entrée station","Sortie station","By-pass","Sortie prétraitement",null,null,"0926220001",18500,"Collectivité"]
["OLMETO-TARAVO (20)","75255",null,null,null,null,null,null,"0920189002",7500,"Collectivité"]
["OLONZAC (34)","34189",null,null,null,null,null,null,"0934189001",2700,"Collectivité"]
["OMYA (ORGON 13 )","15162F","Entrée station","Sortie station",null,null,null,null,null,null,"Industrie"]
["ONNION (74)","74205",null,null,null,null,null,null,"0974205001",2000,"Collectivité"]
["ORAISON (04)","04937",null,null,null,null,null,null,"0904143001",4000,"Collectivité"]
["ORANGE (84)","84087",null,null,null,null,null,null,"0984087001",22000,"Collectivité"]
["ORCHAMPS (39)","39396","Sortie station",null,null,null,null,null,"0939396001",2000,"Collectivité"]
["ORCHAMPS VENNES (25)","25432",null,null,null,null,null,null,"0925432001",2500,"Collectivité"]
["ORCIERES - MERLETTE (05)","05096",null,null,null,null,null,null,"0905096001",17000,"Collectivité"]
["OREDUI (GRASSE 06)","29459","Rejet égout communal",null,null,null,null,null,null,null,"Industrie","SRR-08009"]
["ORGAMOL France (SAINT VULBAS 01)","40685Y","Rejet usine",null,null,null,null,null,null,null,"Industrie"]
["ORGASYNTH INDUSTRIES (GRASSE 06)","29731S","Entrée station","Sortie station",null,null,null,null,null,null,"Industrie"]
["ORGELET (39)","39397",null,null,null,null,null,null,"0939397001",4400,"Collectivité"]
["ORGON (13)","13067",null,null,null,null,null,null,"0913067001",2000,"Collectivité"]
["ORNANS (25)","25434",null,null,null,null,null,null,"0925434001",4500,"Collectivité"]
["OSIRIS (ROUSSILLON 38)","59340","Entrée station","Sortie station","Rejet général",null,null,null,null,null,"Industrie","93-002"]
["OSSEJA PALAU (66)","66964",null,null,null,null,null,null,"0966130001",4100,"Collectivité"]
["OTA PORTO (20)","20198",null,null,null,null,null,null,"0920198001",6300,"Collectivité"]
["OUVEILLAN (11)","11966",null,null,null,null,null,null,"0911269001",2400,"Collectivité"]
["OYONNAX - GROISSIAT (01)","01938",null,null,null,null,null,null,"0901181001",57000,"Collectivité"]
["P.C.A.S. (BOURGOIN JALLIEU 38)","16831V","Rejet usine",null,null,null,null,null,null,null,"Industrie"]
["PALAU DEL VIDRE (66)","66981",null,null,null,null,null,null,"0966133002",4700,"Collectivité"]
["PALAVAS LES FLOTS (34)","34910",null,null,null,null,null,null,"0934192001",45000,"Collectivité"]
["PALMID'OR BOURGOGNE S.A. (71)","71972",null,null,null,null,null,null,"0971546100",6500,"Collectivité"]
["PANZANI WS (MARSEILLE 13)",null,null,null,null,null,null,null,null,null,"Industrie"]
["PAPETERIES CANSON SAS MOULIN DU ROY (DAVEZIEUX 07)","80623",null,null,null,null,null,null,null,null,"Industrie","SRR-09009"]
["PAPETERIES CASCADES (LA ROCHETTE 73)","28295","Rejet Machine","Sortie Echangeur","Egout UP","Rejet Isère",null,null,null,null,"Industrie","07-008"]
["PAPETERIES DE CRAN (CRAN GEVRIER 74)",null,null,null,null,null,null,null,null,null,"Industrie"]
["PAPETERIES DE GROMMELLE (SAINT SATURNIN LES AVIGNON 84)","22683F","Entrée station","Sortie station",null,null,null,null,null,null,"Industrie"]
["PAPETERIES DE LANCEY (BRIGNOUD 38)","17177W","Entrée station","Sortie station",null,null,null,null,null,null,"Industrie"]
["PAPETERIES DE MANDEURE (MANDEURE 25)","15745","Entrée station","Sortie station",null,null,null,null,null,null,"Industrie","SRR-11007"]
["PAPETERIES DE VOIRON (VOREPPE 38)","60575T","Entrée sation","Rejet Isère",null,null,null,null,null,null,"Industrie"]
["PAPETERIES DU LEMAN (THONON 74)","19183","Entrée station","Atelier pâte","Sortie station",null,null,null,null,null,"Industrie","92-005"]
["PAPETERIES ETIENNE (ARLES 13)","14884D","Entrée Krofta","rejet R1","rejet R2",null,null,null,null,null,"Industrie"]
["PAPETERIES MATUSSIERE ET FOREST (DOMENE 38)","24980C","Entrée station","Sortie station",null,null,null,null,null,null,"Industrie"]
["PAPETERIES MATUSSIERE ET FOREST (ENTRE DEUX GUIERS 38)","16886E","Entrée station","Sortie station",null,null,null,null,null,null,"Industrie"]
["PAPETERIES MOULIN VIEUX (PONTCHARA 38)","63001",null,"sortie Krofta","Rejet non traité",null,null,null,null,null,"Industrie"]
["PARROT S.A. (DOLE 39)","17271Y","Sortie station",null,null,null,null,null,null,null,"Industrie"]
["PASSY - SAINT GERVAIS (74)","74934",null,null,null,null,null,null,"0974208001",44000,"Collectivité"]
["PATURAGE COMTOIS (ABONCOURT 70)","87007",null,null,null,null,null,null,null,null,"Industrie","SRR-08011"]
["PATURLE ACIERS (SAINT LAURENT DU PONT 38)","17083U","Sortie station",null,null,null,null,null,null,null,"Industrie"]
["PAULHAN (34)","34194",null,null,null,null,null,null,"0934194001",3700,"Collectivité"]
["PCAS (BOURGOIN 38)","16831",null,null,null,null,null,null,null,null,"Industrie","88-014"]
["PEILLE (06)","06091",null,null,null,null,null,null,"0906091001",2000,"Collectivité"]
["PEILLONNEX THY (74)","74931",null,null,null,null,null,null,"0974209001",7000,"Collectivité"]
["PEIPIN (04)","04145",null,null,null,null,null,null,"0904145001",2000,"Collectivité"]
["PELOUSEY - VILLAGE (25)","25448",null,null,null,null,null,null,"0925448001",2300,"Collectivité"]
["PELUSSIN (42)","42168",null,null,null,null,null,null,"0942168001",6500,"Collectivité"]
["PENNES MIRABEAU (13)","13071",null,null,null,null,null,null,"0913071001",7500,"Collectivité"]
["PEPINO (TARARE 69)",null,null,null,null,null,null,null,null,null,"Industrie"]
["PERNES LES FONTAINES (84)","84903",null,null,null,null,null,null,"0984088002",12000,"Collectivité"]
["PERON L'EPINE (01)","01990",null,null,null,null,null,null,"0901288003",4700,"Collectivité"]
["PERPIGNAN (66)","66966","Entrée station","Sortie biologique","By pass PC",null,null,null,"0966136001",160000,"Collectivité"]
["PERRIN VERMOT (CLERON 25)","15519U","Entrée station","Sortie station",null,null,null,null,null,null,"Industrie"]
["PERRIN VERMOT (CLERON 25)",null,"Entrée station","Sortie station",null,null,null,null,null,null,"Industrie"]
["PERSTORP FRANCE (RHODIA OPERATIONS) (PONT DE CLAIX 38)","85078",null,null,null,null,null,null,null,null,"Industrie","97-004"]
["PERTUIS (84)","84905",null,null,null,null,null,null,"0984089001",35000,"Collectivité"]
["PEUGEOT (MONTBELIARD 25)","15752","Entrée Station Finale","Sortie Station Finale","Entrée Station Bio","Sortie Station Bio",null,null,null,null,"Industrie","88-003"]
["PEYMEINADE (06)","06903",null,null,null,null,null,null,"0906095001",20000,"Collectivité"]
["PEYNIER (13)","13072",null,null,null,null,null,null,"0913072001",2000,"Collectivité"]
["PEYRESTORTES (66)","66966","Sortie station",null,null,null,null,null,"0966138002",2700,"Collectivité"]
["PEYRIAC DE MER (11)","11966","Sortie station",null,null,null,null,null,"0911285002",3000,"Collectivité"]
["PEYROLLES (13)","13074",null,null,null,null,null,null,"0913074002",6200,"Collectivité"]
["PEYRUIS (04)","04149",null,null,null,null,null,null,"0904149001",2300,"Collectivité"]
["PEZENAS (34)","34199",null,null,null,null,null,null,"0934199001",32000,"Collectivité"]
["PEZILLA LA RIVIERE (66)","66966",null,null,null,null,null,null,"0966140001",3200,"Collectivité"]
["PHAFFANS - BESSONCOURT (90)","90926",null,null,null,null,null,null,"0990080002",3600,"Collectivité"]
["PIA (66)","66141",null,null,null,null,null,null,"0966141001",6000,"Collectivité"]
["PIANA (20)","20212",null,null,null,null,null,null,"0920212001",2500,"Collectivité"]
["PIERREFEU DU VAR (83)","83091",null,null,null,null,null,null,"0983091001",5000,"Collectivité"]
["PIERREFONTAINE LES VARANS (25)","25453",null,null,null,null,null,null,"0925453001",5000,"Collectivité"]
["PIERRELATTE (26)","26235","Entrée station","Sortie station",null,null,null,null,"0926235001",15800,"Collectivité"]
["PIETROSELLA - CRUCCIATA (20)","20927",null,null,null,null,null,null,"0920228001",27000,"Collectivité"]
["PIGNAN (34)","34926",null,null,null,null,null,null,"0934202002",4800,"Collectivité"]
["PIGNANS (83)","83092",null,null,null,null,null,null,"0983092002",4500,"Collectivité"]
["PINET - POMEROLS (34)","34924",null,null,null,null,null,null,"0934203001",4700,"Collectivité"]
["PIOLENC (84)","84091",null,null,null,null,null,null,"0984091001",2500,"Collectivité"]
["PLAN DE LA TOUR - PRES D'ICARD (83)","83094",null,null,null,null,null,null,"0983094001",5000,"Collectivité"]
["PLANCHE (CASTELNAU LE LEZ 34)",null,null,null,null,null,null,null,null,null,"Industrie"]
["PLASNE (39)","39426",null,null,null,null,null,null,"0939426001",2000,"Collectivité"]
["PLOMBIERES LES BAINS - VILLE (88)","88351",null,null,null,null,null,null,"060988351002",3500,"Collectivité"]
["PLUVET (21)","21909",null,null,null,null,null,null,"0921487001",5000,"Collectivité"]
["POINT (VIRIAT 01)","14259Z","Entrée station","Sortie station",null,null,null,null,null,null,"Industrie"]
["POISY LES POIRIERS (74)","74925",null,null,null,null,null,null,"0974182001",32000,"Collectivité"]
["POLIGNY (39)","39434",null,null,null,null,null,null,"0939434001",9000,"Collectivité"]
["POLIMETAL (GENAS 69 )","27879D","Sortie station",null,null,null,null,null,null,null,"Industrie"]
["POLLESTRES (66)","66966",null,null,null,null,null,null,"0966144002",4500,"Collectivité"]
["POLLIAT (01)","01301",null,null,null,null,null,null,"0901301002",2000,"Collectivité"]
["POMMIERS LE CARRY (69)","69924",null,null,null,null,null,null,"0969156003",5500,"Collectivité"]
["PONT D'AIN (01)","01304",null,null,null,null,null,null,"0901304001",3500,"Collectivité"]
["PONT DE BEAUVOISIN (38)","38941",null,null,null,null,null,null,"0938315002",3400,"Collectivité"]
["PONT DE POITTE (39)","39435",null,null,null,null,null,null,"0939435001",2500,"Collectivité"]
["PONT DE ROIDE (25)","25955",null,null,null,null,null,null,"0925463001",9700,"Collectivité"]
["PONT DE VAUX (01)","01986",null,null,null,null,null,null,"0901305002",5000,"Collectivité"]
["PONT DE VEYLE (01)","01306",null,null,null,null,null,null,"0901306002",2300,"Collectivité"]
["PONT SAINT ESPRIT (30)","30202",null,null,null,null,null,null,"0930202001",11700,"Collectivité"]
["PONTAILLER OUESAINT - VONGES (21)","21927",null,null,null,null,null,null,"0921496002",2500,"Collectivité"]
["PONTARLIER (25)","25992",null,null,null,null,null,null,"0925204001",53000,"Collectivité"]
["PONTCHARRA (38)","38827",null,null,null,null,null,null,"0938314001",28000,"Collectivité"]
["PONTEILLA (66)","66977","Sortie station",null,null,null,null,null,"0966145004",2200,"Collectivité"]
["POPY (ST QUENTIN FALLAVIER 38 )","17108W","Entrée station","Sortie station",null,null,null,null,null,null,"Industrie"]
["PORT LA NOUVELLE (11)","11266",null,null,null,null,null,null,"0911266002",30000,"Collectivité"]
["PORTES LES VALENCE (26)","26957","Entrée station","Sortie station File 1","Sortie BO","Sortie station File 2",null,null,"0926252001",76000,"Collectivité"]
["PORTIRAGNES (34)","34209",null,null,null,null,null,null,"0934209002",13000,"Collectivité"]
["PORTO VECCHIO - CAPO DI PADULE (20)","20247",null,null,null,null,null,null,"0920247002",30000,"Collectivité"]
["POUILLEY LES VIGNES (25)","25467",null,null,null,null,null,null,"0925467002",3000,"Collectivité"]
["POULX (30)","30817",null,null,null,null,null,null,"0930206002",5000,"Collectivité"]
["POURRIERES (83)","83097",null,null,null,null,null,null,"0983097002",5000,"Collectivité"]
["POUSSAN (34)","34978",null,null,null,null,null,null,"0934213002",6700,"Collectivité"]
["PRADES LALEVADE (07)","10025",null,null,null,null,null,null,"0907182001",2650,"Collectivité"]
["PRADES RIVE DROITE (66)","66970",null,null,null,null,null,null,"0966149002",9000,"Collectivité"]
["PRADES RIVE GAUCHE CATLLAR (66)","66970",null,null,null,null,null,null,"0966149001",3500,"Collectivité"]
["PRATS DE MOLLO LA PRESTE (66)","66150",null,null,null,null,null,null,"0966150001",5000,"Collectivité"]
["PRAZ SUR ARLY (74)","74173",null,null,null,null,null,null,"0974215001",50000,"Collectivité"]
["PREMANON (39)","39441",null,null,null,null,null,null,"0939441001",2100,"Collectivité"]
["PREVESSIN MOENS - GEX (01)","01990",null,null,null,null,null,null,"0901313001",14300,"Collectivité"]
["PRISSE BOURG (71)","71360",null,null,null,null,null,null,"0971360003",5000,"Collectivité"]
["PRIVAS - GRATENAS (07)","07954",null,null,null,null,null,null,"0907186001",16000,"Collectivité"]
["PROFILS SYSTEMES (BAILLARGUES 34)","67015",null,null,null,null,null,null,null,null,"Industrie","SRR-"]
["PROPRIANO (20)","75255",null,null,null,null,null,null,"0920249001",15000,"Collectivité"]
["PROVENCE TOMATES (TARASCON 13)","86476",null,null,null,null,null,null,null,null,"Industrie","SRR-10003"]
["PUGET - VILLE (83)","83100",null,null,null,null,null,null,"0983100001",4200,"Collectivité"]
["PUGET THENIERS (06)","06099",null,null,null,null,null,null,"0906099001",3500,"Collectivité"]
["PUIGCERDA (66)","66955",null,null,null,null,null,null,"0966025001",30000,"Collectivité"]
["PUIGCERDA (66)","66912",null,null,null,null,null,null,"0966072002",30000,"Collectivité"]
["PUISSERGUIER (34)","34225",null,null,null,null,null,null,"0934225001",2300,"Collectivité"]
["PUJAUT (30)","30209",null,null,null,null,null,null,"0930209002",4000,"Collectivité"]
["PUY SAINTE REPARADE (13)","13080",null,null,null,null,null,null,"0913080001",3500,"Collectivité"]
["PUYVALADOR (66)","66154",null,null,null,null,null,null,"0966154001",4200,"Collectivité"]
["QUARANTE (34)","34226",null,null,null,null,null,null,"0934226001",3200,"Collectivité"]
["QUILLAN - CHEF LIEU (11)","11304",null,null,null,null,null,null,"0911304001",6000,"Collectivité"]
["QUINCEY - NUITS SAINT GEORGES (21)","72794",null,null,null,null,null,null,"0921517001",28000,"Collectivité"]
["QUINCIEUX LE BOURG (69)","69163",null,null,null,null,null,null,"0969163002",2700,"Collectivité"]
["QUINTENAS SAINT ROMAIN D'AY (07)","07188",null,null,null,null,null,null,"0907188002",2400,"Collectivité"]
["QUISSAC (30)","30210",null,null,null,null,null,null,"0930210002",3500,"Collectivité"]
["RAMATUELLE - BONNE TERRASSE (83)","83101",null,null,null,null,null,null,"0983101002",21000,"Collectivité"]
["RANCHOT - DAMPIERRE (39)","39986",null,null,null,null,null,null,"0939451002",4000,"Collectivité"]
["RASTEAU (84)","84096",null,null,null,null,null,null,"0984096001",2100,"Collectivité"]
["RAYNAL & ROQUELAURE (CAMARET 84)","35151","Entrée station","Sortie station",null,null,null,null,null,null,"Industrie","97-003"]
["REDESSAN (30)","30817",null,null,null,null,null,null,"0930211002",4500,"Collectivité"]
["REFRESCO FRANCE (DELIFRUIT) (MARGES 26)","27117",null,null,null,null,null,null,null,null,"Industrie","SRR-"]
["REFRESCO FRANCE (NUITS ST GEORGES 21)","93855",null,null,null,null,null,null,null,null,"Industrie","SRR-"]
["REGUSSE (83)","83914",null,null,null,null,null,null,"0983102001",3000,"Collectivité"]
["REIGNIER - ESERY SCIENTRIER (74)","74932",null,null,null,null,null,null,"0974220001",16000,"Collectivité"]
["REILLANNE (04)","04160",null,null,null,null,null,null,"0904160001",2000,"Collectivité"]
["RELTEX (VIRIEU SUR BOURBRE 38 )","29234B","Entrée station","Sortie station",null,null,null,null,null,null,"Industrie"]
["REMOULINS (30)","30986",null,null,null,null,null,null,"0930212002",6000,"Collectivité"]
["RENCAST (TREVOUX 01)","33589K","Sortie station",null,null,null,null,null,null,null,"Industrie"]
["RENNES LES BAINS (11)","11310",null,null,null,null,null,null,"0911310002",2000,"Collectivité"]
["REPLONGES (01)","01320",null,null,null,null,null,null,"0901320001",3600,"Collectivité"]
["REVETEMENT ELECTOLYTIQUE METAUX (DIJON 21 )","36027A","Sortie station",null,null,null,null,null,null,null,"Industrie"]
["REVETEMENT ELECTROLYTIQUE DES METAUX (REM) (DIJON 21)","36027",null,null,null,null,null,null,null,null,"Industrie","SRR-"]
["RHODIA BELLE ETOILE (SAINT FONS 69)","18031Z","Déverse Centre","Déverse Sud","Envoi Gepeif",null,null,null,null,null,"Industrie"]
["RHODIA ENGINEERING PLASTICS (SAINT FONS 69)","43800J","Rejet usine",null,null,null,null,null,null,null,"Industrie"]
["RHODIA OPERATIONS (BELLE ETOILE) (ST FONS 69)","77223",null,null,null,null,null,null,null,null,"Industrie","88-002"]
["RHODIA OPERATIONS (COLLONGES AU MONT D'OR 69)","75171",null,null,null,null,null,null,null,null,"Industrie","95-004"]
["RHODIA OPERATIONS (EX ENGINEERING) (ST FONS 69)","77112",null,null,null,null,null,null,null,null,"Industrie","99-007"]
["RHODIA OPERATIONS (ORGANIQUE) (ST FONS 69)","76176",null,null,null,null,null,null,null,null,"Industrie","88-010"]
["RIANS (83)","83104",null,null,null,null,null,null,"0983104001",3000,"Collectivité"]
["RIEUX MINERVOIS (11)","11315",null,null,null,null,null,null,"0911315002",3200,"Collectivité"]
["RIEZ (04)","04166",null,null,null,null,null,null,"0904166001",6000,"Collectivité"]
["RIOLS - SAINT PONS (34)","34885",null,null,null,null,null,null,"0934229001",6000,"Collectivité"]
["RIVE DE GIERS - TARTARAS (42)","42907",null,null,null,null,null,null,"0942307001",41000,"Collectivité"]
["RIVESALTES (66)","66164",null,null,null,null,null,null,"0966164001",11500,"Collectivité"]
["RIVIERE DRUGEON (25)","25802",null,null,null,null,null,null,"0925493001",7000,"Collectivité"]
["ROBERTET (GRASSE 06)","27188","Rejet ville","Eaux diluées plan","Eaux concentrées plan","Sortie station",null,null,null,null,"Industrie","00-003"]
["ROBION (84)","84099",null,null,null,null,null,null,"0984099004",3800,"Collectivité"]
["ROCBARON - FORCALQUEIRET (83)","83933",null,null,null,null,null,null,"0983106001",4000,"Collectivité"]
["ROCHEFORT DU GARD (30)","84943",null,null,null,null,null,null,"0930217001",7000,"Collectivité"]
["RODILHAN (30)","30817",null,null,null,null,null,null,"0930356002",5500,"Collectivité"]
["ROGNAC (13)","13940",null,null,null,null,null,null,"0913081001",16000,"Collectivité"]
["ROGNONAS (13)","13083",null,null,null,null,null,null,"0913083002",4900,"Collectivité"]
["ROMANS SUR ISERE (26)","26281","Entrée station","Sortie station 1","Sortie station 2","By-pass biologique Fil. 1","By-pass biologique Fil. 2",null,"0926281001",90000,"Collectivité"]
["RONCHAMP (70)","70963",null,null,null,null,null,null,"0970451001",12000,"Collectivité"]
["ROQUEBILLIERE (06)","06103",null,null,null,null,null,null,"0906103001",3000,"Collectivité"]
["ROQUEBRUNE - LA GAILLARDE (83)","83107",null,null,null,null,null,null,"0983107002",23000,"Collectivité"]
["ROQUEBRUNE SUR ARGENS - BLAVET (83)","83107",null,null,null,null,null,null,"0983107003",5000,"Collectivité"]
["ROQUEBRUNE SUR ARGENS- LE PLANET (83)","83107",null,null,null,null,null,null,"0983107004",10000,"Collectivité"]
["ROQUEFORT LA BEDOULE (13)","13939",null,null,null,null,null,null,"0913085001",6000,"Collectivité"]
["ROQUEMAURE (30)","30221",null,null,null,null,null,null,"0930221001",7500,"Collectivité"]
["ROQUESTERON (06)","06106",null,null,null,null,null,null,"0906106002",2000,"Collectivité"]
["ROUJAN CH. ALIGNAN (34)","34237",null,null,null,null,null,null,"0934237002",2500,"Collectivité"]
["ROUSSELOT (SKW GELATIN SPECIALITIES) (AUBAGNE 13 )",null,"Eaux de chaulage","Eaux de cuisson","Eaux propres","Sortie station",null,null,null,null,"Industrie"]
["ROUSSELOT ISLE SUR LA SORGUE (L'ISLE S/SORGUES 84)","76855","Entrée station","Sortie station",null,null,null,null,null,null,"Industrie","93-003"]
["ROUSSET - CHEF LIEU (13)",null,null,null,null,null,null,null,"0913087002",4100,"Collectivité"]
["ROUSSET (13)","13087",null,null,null,null,null,null,"0913087003",12000,"Collectivité"]
["ROUSSILLON - PEAGE DE ROUSSILLON (38)","38938",null,null,null,null,null,null,"0938344001",22000,"Collectivité"]
["ROUSSON - LE SAUT DU LOUP (30)","30223",null,null,null,null,null,null,"0930223002",3500,"Collectivité"]
["ROUTIN (LA MOTTE SERVOLEX 73)","28871",null,null,null,null,null,null,null,null,"Industrie"]
["RUFFEY LES ECHIREY (21)","21535",null,null,null,null,null,null,"0921535001",2000,"Collectivité"]
["RUGET (CHAPONOST 69)","17733A","Sortie station",null,null,null,null,null,null,null,"Industrie"]
["RULLY (71)","71378",null,null,null,null,null,null,"0971378002",2700,"Collectivité"]
["RUMILLY (74)","74225","Entrée station","Sortie station","By-pass",null,null,null,"0974225001",49000,"Collectivité"]
["RUOMS (07)","10025",null,null,null,null,null,null,"0907201001",9000,"Collectivité"]
["S.A.F.R. (XERTIGNY 88)",null,"Entrée station","Sortie station",null,null,null,null,null,null,"Industrie"]
["S.C.A.T.V. LE CABANON (CAMARET SUR AIGUES 84)","19612T","Rejet Usine",null,null,null,null,null,null,null,"Industrie"]
["S.E.T.C.M. (MEYREUIL 13)","58082H","Sortie station",null,null,null,null,null,null,null,"Industrie"]
["S.I.E.G.L (LE GRAND LEMPS 38)",null,null,null,null,null,null,null,null,null,"Industrie"]
["S.L.M.C. (NARBONNE 11)",null,"rejet bassin de régulation",null,null,null,null,null,null,null,"Industrie"]
["S.N.R. ROULEMENT (ANNECY 74)","18963M","Sortie station",null,null,null,null,null,null,null,"Industrie"]
["S2A (CASTELNAUDARY 11)","14691U","Entrée station","Sortie station",null,null,null,null,null,null,"Industrie"]
["SABATON (AUBENAS 07)","14554V","Entrée station","Sortie station",null,null,null,null,null,null,"Industrie"]
["SABLET (84)","84104",null,null,null,null,null,null,"0984104001",3900,"Collectivité"]
["SAFR XERTIGNY (XERTIGNY 88)","19787H",null,null,null,null,null,null,null,null,"Industrie"]
["SAILLANS (26)","26289",null,null,null,null,null,null,"0926289002",2700,"Collectivité"]
["SAIN BEL (69)","69980",null,null,null,null,null,null,"0969171001",3500,"Collectivité"]
["SAINT AGREVE (07)","07204",null,null,null,null,null,null,"0907204003",8000,"Collectivité"]
["SAINT ALBAN DU RHONE (38)","38828",null,null,null,null,null,null,"0938353001",16000,"Collectivité"]
["SAINT AMBROIX (30)","30227",null,null,null,null,null,null,"0930227001",5900,"Collectivité"]
["SAINT AMOUR (39)","39805",null,null,null,null,null,null,"0939475001",5000,"Collectivité"]
["SAINT ANDIOL (13)","13904",null,null,null,null,null,null,"0913089001",4000,"Collectivité"]
["SAINT ANDRE BASSE PLAINE (66)","66981",null,null,null,null,null,null,"0966168002",17000,"Collectivité"]
["SAINT ANDRE DE CORCY (01)","01333",null,null,null,null,null,null,"0901333002",5000,"Collectivité"]
["SAINT ANDRE DE SANGONIS (34)","34239",null,null,null,null,null,null,"0934239002",5000,"Collectivité"]
["SAINT ANDRE LES ALPES (04)","04173",null,null,null,null,null,null,"0904173001",4500,"Collectivité"]
["SAINT AUBIN (39)","39476","Sortie station",null,null,null,null,null,"0939476001",2000,"Collectivité"]
["SAINT AUNES (34)","34899",null,null,null,null,null,null,"0934240001",23000,"Collectivité"]
["SAINT BONNET EN CHAMPSAUR (05)","05132",null,null,null,null,null,null,"0905132002",6000,"Collectivité"]
["SAINT BRES (34)","34926",null,null,null,null,null,null,"0934244002",2000,"Collectivité"]
["SAINT CANNAT (13)","13091",null,null,null,null,null,null,"0913091001",3000,"Collectivité"]
["SAINT CHAMAS (13)","13903",null,null,null,null,null,null,"0913092001",38000,"Collectivité"]
["SAINT CHAMOND (42)","42207",null,null,null,null,null,null,"0942207002",64000,"Collectivité"]
["SAINT CHAPTES (30)","30241",null,null,null,null,null,null,"0930241002",2000,"Collectivité"]
["SAINT CHINIAN -B OURG (34)","34245",null,null,null,null,null,null,"0934245001",3000,"Collectivité"]
["SAINT CHRISTOL LEZ ALES (30)","30810",null,null,null,null,null,null,"0930243001",6500,"Collectivité"]
["SAINT CLAUDE - VILLE (39)","39478",null,null,null,null,null,null,"0939478003",15000,"Collectivité"]
["SAINT CLEMENT - ROUARGUE (34)","34247",null,null,null,null,null,null,"0934247004",5000,"Collectivité"]
["SAINT CLEMENT - ZONE COMMERCIALE (34)","34247",null,null,null,null,null,null,"0934247003",2000,"Collectivité"]
["SAINT CYPRIEN (66)","66925","Entrée station - 1","Entrée station - 2","Sortie station",null,null,null,"0966171002",77000,"Collectivité"]
["SAINT CYR (07)","07227",null,null,null,null,null,null,"0907227002",2000,"Collectivité"]
["SAINT CYR SUR MER (83)","83112",null,null,null,null,null,null,"0983112001",23000,"Collectivité"]
["SAINT DENIS LES BOURG (01)","01344",null,null,null,null,null,null,"0901344002",4500,"Collectivité"]
["SAINT DIDIER DE FORMANS (01)","01814",null,null,null,null,null,null,"0901347002",4500,"Collectivité"]
["SAINT DIDIER LES BAINS (84)","84903",null,null,null,null,null,null,"0984108001",3000,"Collectivité"]
["SAINT DONAT SUR L'HERBASSE (26)","26301",null,null,null,null,null,null,"0926301001",2200,"Collectivité"]
["SAINT ETIENNE DE CUINES (73)","73231",null,null,null,null,null,null,"0973231001",2000,"Collectivité"]
["SAINT ETIENNE DE TINEE - AURON (06)","06120",null,null,null,null,null,null,"0906120001",12000,"Collectivité"]
["SAINT ETIENNE DES OULLIERES (69)","69947",null,null,null,null,null,null,"0969197002",32000,"Collectivité"]
["SAINT ETIENNE DU BOIS (01)","01350",null,null,null,null,null,null,"0901350001",2000,"Collectivité"]
["SAINT ETIENNE DU GRES -CHEF LIEU (13)","13094",null,null,null,null,null,null,"0913094002",3200,"Collectivité"]
["SAINT ETIENNE EN DEVOLUY (05)","05139",null,null,null,null,null,null,"0905139001",12600,"Collectivité"]
["SAINT FELIU D'AVALL (66)","66966",null,null,null,null,null,null,"0966174002",5000,"Collectivité"]
["SAINT FELIU D'AVALL (66)",null,null,null,null,null,null,null,"0966174001",2000,"Collectivité"]
["SAINT FELIX (74)","74971",null,null,null,null,null,null,"0974233001",10700,"Collectivité"]
["SAINT FLORENT (20)","20298",null,null,null,null,null,null,"0920298001",9500,"Collectivité"]
["SAINT FRANCOIS LONGCHAMP (73)","73983",null,null,null,null,null,null,"0973235001",2500,"Collectivité"]
["SAINT GELY DU FESC (34)","34255",null,null,null,null,null,null,"0934255001",14800,"Collectivité"]
["SAINT GENIES DE COMOLAS (30)","30918",null,null,null,null,null,null,"0930254001",5000,"Collectivité"]
["SAINT GENIES DE FONTEDIT (34)","34258",null,null,null,null,null,null,"0934258001",2000,"Collectivité"]
["SAINT GENIES DE MALGOIRES (30)","30255",null,null,null,null,null,null,"0930255001",3000,"Collectivité"]
["SAINT GENIS DES FONTAINES (66)","66981",null,null,null,null,null,null,"0966175001",3200,"Collectivité"]
["SAINT GENIS POUILLY (01)","01990",null,null,null,null,null,null,"0901354001",27000,"Collectivité"]
["SAINT GENIX SUR GUIERS (73)","73236",null,null,null,null,null,null,"0973236001",2000,"Collectivité"]
["SAINT GEORGES DE RENEINS (69)","69206",null,null,null,null,null,null,"0969206002",9900,"Collectivité"]
["SAINT GEORGES D'ORQUES (34)","34926",null,null,null,null,null,null,"0934259002",7000,"Collectivité"]
["SAINT GEORGES LES BAINS (07)","07961",null,null,null,null,null,null,"0907240002",6000,"Collectivité"]
["SAINT GERMAIN AU MONT D'OR (69)","69901",null,null,null,null,null,null,"0969207001",3000,"Collectivité"]
["SAINT GERVASY BEZOUCE (30)","30817",null,null,null,null,null,null,"0930257002",4600,"Collectivité"]
["SAINT GILLES (30)","30817",null,null,null,null,null,null,"0930258001",14400,"Collectivité"]
["SAINT HILAIRE (11)","11344","Sortie station",null,null,null,null,null,"0911344001",3000,"Collectivité"]
["SAINT HILAIRE DU TOUVET - HOPITAL (38)","38963",null,null,null,null,null,null,"0938395001",2000,"Collectivité"]
["SAINT HIPPOLITE DU FORT (30)","30263",null,null,null,null,null,null,"0930263001",9000,"Collectivité"]
["SAINT HIPPOLYTE (66)","66966",null,null,null,null,null,null,"0966176002",3000,"Collectivité"]
["SAINT JEAN D'ARVES - SAINT SORLIN (73)","73989",null,null,null,null,null,null,"0973242001",17000,"Collectivité"]
["SAINT JEAN D'AULPS (74)","74238",null,null,null,null,null,null,"0974238001",4000,"Collectivité"]
["SAINT JEAN DE BOURNAY (38)","38399",null,null,null,null,null,null,"0938399001",5400,"Collectivité"]
["SAINT JEAN DE GONVILLE- CHEF.LIEU (01)","01990",null,null,null,null,null,null,"0901360002",2300,"Collectivité"]
["SAINT JEAN DE LOSNE (21)","21804",null,null,null,null,null,null,"0921554001",5400,"Collectivité"]
["SAINT JEAN DE MAURIENNE (73)","73972",null,null,null,null,null,null,"0973248001",20000,"Collectivité"]
["SAINT JEAN DE SIXT (74)","74985",null,null,null,null,null,null,"0974239004",29000,"Collectivité"]
["SAINT JEAN DE SIXT BORNE (74)","74985",null,null,null,null,null,null,"0974239003",27000,"Collectivité"]
["SAINT JEAN DU GARD (30)","30810",null,null,null,null,null,null,"0930269001",5000,"Collectivité"]
["SAINT JEAN EN ROYANS (26)","26307",null,null,null,null,null,null,"0926307001",3300,"Collectivité"]
["SAINT JEAN PLA DE CORTS (66)","66178",null,null,null,null,null,null,"0966178001",2500,"Collectivité"]
["SAINT JEOIRE EN FAUCIGNY (74)","74241",null,null,null,null,null,null,"0974241001",2900,"Collectivité"]
["SAINT JULIEN - CHEF-LIEU (83)","83113",null,null,null,null,null,null,"0983113005",2700,"Collectivité"]
["SAINT JULIEN EN GENEVOIS (74)","74917",null,null,null,null,null,null,"0974243001",6700,"Collectivité"]
["SAINT JUSAINT ET SAINT NAZAIRE DE PEZAN (34)","34272",null,null,null,null,null,null,"0934272001",2700,"Collectivité"]
["SAINT LAURENT DE CERDANS (66)","66179",null,null,null,null,null,null,"0966179001",2500,"Collectivité"]
["SAINT LAURENT DE CHAMOUSSET (69)","69220",null,null,null,null,null,null,"0969220002",3200,"Collectivité"]
["SAINT LAURENT DE LA SALANQUE (66)","66966",null,null,null,null,null,null,"0966180001",8300,"Collectivité"]
["SAINT LAURENT DU PONT (38)","38412",null,null,null,null,null,null,"0938412001",6500,"Collectivité"]
["SAINT LAURENT EN GRANDVAUX (39)","39487",null,null,null,null,null,null,"0939487001",4500,"Collectivité"]
["SAINT LEGER SUR DHEUNE (71)","71442",null,null,null,null,null,null,"0971442002",2000,"Collectivité"]
["SAINT LOUIS SUCRE (MARSEILLE 13)","15005K","Entrée station","Sortie station",null,null,null,null,null,null,"Industrie"]
["SAINT LOUP DE VARENNES - LE GRAND (71)","71934",null,null,null,null,null,null,"0971444001",2300,"Collectivité"]
["SAINT LOUP SUR SEMOUSE (70)","70959",null,null,null,null,null,null,"0970467001",6000,"Collectivité"]
["SAINT LUPICIN (39)","39491",null,null,null,null,null,null,"0939491002",3500,"Collectivité"]
["SAINT MARCEL BEL ACCUEIL (38)","38826",null,null,null,null,null,null,"0938415001",5500,"Collectivité"]
["SAINT MARCELLIN (38)","38969",null,null,null,null,null,null,"0938416001",20000,"Collectivité"]
["SAINT MARTIN BELLEVILLE MENUIRES (73)","73257",null,null,null,null,null,null,"0973257001",45000,"Collectivité"]
["SAINT MARTIN D'ARDECHE (07)","07268",null,null,null,null,null,null,"0907268001",2200,"Collectivité"]
["SAINT MARTIN DE BELLEVILLE - BOURG (73)","73257",null,null,null,null,null,null,"0973257002",2000,"Collectivité"]
["SAINT MARTIN DE CRAU (13)","13942",null,null,null,null,null,null,"0913097001",15000,"Collectivité"]
["SAINT MARTIN DE LONDRES (34)","34274",null,null,null,null,null,null,"0934274001",2500,"Collectivité"]
["SAINT MARTIN D'URIAGE (38)","38422",null,null,null,null,null,null,"0938422001",11700,"Collectivité"]
["SAINT MARTIN VESUBIE (06)","06127",null,null,null,null,null,null,"0906127001",2500,"Collectivité"]
["SAINT MATHIEU DE TREVIERS (34)","34276",null,null,null,null,null,null,"0934276001",6000,"Collectivité"]
["SAINT MAURICE DE GOURDANS (01)","01378",null,null,null,null,null,null,"0901378001",2000,"Collectivité"]
["SAINT MAURICE L'EXIL (38)","38938",null,null,null,null,null,null,"0938425001",7000,"Collectivité"]
["SAINT MAXIMIN LA SAINTE BAUME (83)","83116",null,null,null,null,null,null,"0983116002",6000,"Collectivité"]
["SAINT PARGOIRE (34)","34281",null,null,null,null,null,null,"0934281001",2000,"Collectivité"]
["SAINT PAUL DE FENOUILLET (66)","66187",null,null,null,null,null,null,"0966187001",3800,"Collectivité"]
["SAINT PAUL LES TROIS CHATEAUX (26)","26324",null,null,null,null,null,null,"0926324001",13000,"Collectivité"]
["SAINT PAUL SUR ISERE (73)","57996",null,null,null,null,null,null,"0973268001",2000,"Collectivité"]
["SAINT PIERRE D'ALBIGNY (73)","73898",null,null,null,null,null,null,"0973270002",3600,"Collectivité"]
["SAINT PRIVAT (07)","10025",null,null,null,null,null,null,"0907289001",2500,"Collectivité"]
["SAINT PRIVAT DES VIEUX (30)","30810",null,null,null,null,null,null,"0930294001",3000,"Collectivité"]
["SAINT QUENTIN LA POTERIE (30)","30295",null,null,null,null,null,null,"0930295002",3000,"Collectivité"]
["SAINT RAMBERT D'ALBON (26)","26325",null,null,null,null,null,null,"0926325001",10400,"Collectivité"]
["SAINT RAPHAEL - AGAY (83)","83915",null,null,null,null,null,null,"0983118002",25000,"Collectivité"]
["SAINT REMY (70)","70472",null,null,null,null,null,null,"0970472001",2000,"Collectivité"]
["SAINT REMY DE MAURIENNE (73)","73278",null,null,null,null,null,null,"0973278002",2000,"Collectivité"]
["SAINT ROMAIN DE JALIONAS (38)","38960",null,null,null,null,null,null,"0938451001",10000,"Collectivité"]
["SAINT ROMAIN DE POPEY PONTCHARRA (69)","69982",null,null,null,null,null,null,"0969234002",9200,"Collectivité"]
["SAINT SAUVEUR DE MONTAGUT (07)","07295",null,null,null,null,null,null,"0907295001",3600,"Collectivité"]
["SAINT SORLIN - LAGNIEU (01)","01987",null,null,null,null,null,null,"0901386001",8200,"Collectivité"]
["SAINT SYMPHORIEN D'ANCELLES (71)","71928",null,null,null,null,null,null,"0971481001",18000,"Collectivité"]
["SAINT SYMPHORIEN SUR COISE (69)","69238",null,null,null,null,null,null,"0969238002",16200,"Collectivité"]
["SAINT THIBERY (34)","34289",null,null,null,null,null,null,"0934289001",3600,"Collectivité"]
["SAINT TRIVIER DE COURTES (01)","01388",null,null,null,null,null,null,"0901388001",6800,"Collectivité"]
["SAINT TROPEZ - LA CITADELLE (83)","83119",null,null,null,null,null,null,"0983119001",42000,"Collectivité"]
["SAINT VALLIER DE THIEY (06)","06130",null,null,null,null,null,null,"0906130001",2500,"Collectivité"]
["SAINT VIT (25)","25527",null,null,null,null,null,null,"0925527001",3800,"Collectivité"]
["SAINTE CECILE LES VIGNES (84)","84106",null,null,null,null,null,null,"0984106001",2500,"Collectivité"]
["SAINTE FOY L'ARGENTIERE (69)","69940",null,null,null,null,null,null,"0969201002",2700,"Collectivité"]
["SAINTE HELENE SUR ISERE - CHEF LIEU (73)","73241",null,null,null,null,null,null,"0973241002",2500,"Collectivité"]
["SAINTE MARIE LA MER (66)","66966",null,null,null,null,null,null,"0966182002",18000,"Collectivité"]
["SAINTE MAXIME - LA NARTELLE (83)","83115",null,null,null,null,null,null,"0983115001",50000,"Collectivité"]
["SAINTE SUZANNE (25)","25901","Entrée station","Sortie station","Bassin Orage",null,null,null,"0925526001",65000,"Collectivité"]
["SAINTE TULLE - ZONE ARTISANALE (04)","04197",null,null,null,null,null,null,"0904197002",2000,"Collectivité"]
["SAINTE TULLE (04)","04197",null,null,null,null,null,null,"0904197001",3000,"Collectivité"]
["SAINTES MARIES DE LA MER (13)","13096",null,null,null,null,null,null,"0913096001",18000,"Collectivité"]
["SAIPOL (SETE 34)","67174","Rejet trituration","Rejet raffinage","Sortie station",null,null,null,null,null,"Industrie","SRR-08008"]
["SALADE MINUTE (GENAS 69)",null,null,null,null,null,null,null,null,null,"Industrie"]
["SALAISON DU RUISSEAU (ST QUENTIN FALLAVIER 38 )","36822Z","Entrée station","Sortie station",null,null,null,null,null,null,"Industrie"]
["SALAVAS (07)","07304",null,null,null,null,null,null,"0907304001",4500,"Collectivité"]
["SALEILLES (66)","66925",null,null,null,null,null,null,"0966189002",6500,"Collectivité"]
["SALERNES (83)","83121",null,null,null,null,null,null,"0983121001",10000,"Collectivité"]
["SALINDRES (30)","30810",null,null,null,null,null,null,"0930305001",5000,"Collectivité"]
["SALINS LES BAINS (39)","39500",null,null,null,null,null,null,"0939500002",7000,"Collectivité"]
["SALLANCHES (74)","74998",null,null,null,null,null,null,"0974256001",27000,"Collectivité"]
["SALLELES D'AUDE (11)","11369","Sortie station",null,null,null,null,null,"0911369001",2500,"Collectivité"]
["SALON DE PROVENCE (13)","13940","Entrée station","Sortie station","By-pass",null,null,null,"0913103001",65000,"Collectivité"]
["SALSES (66)","66190",null,null,null,null,null,null,"0966190001",4000,"Collectivité"]
["SANARY - BANDOL (83)","83923","Entrée station","Sortie physico","Sortie biologique",null,null,null,"0983123001",54000,"Collectivité"]
["SANCEY LE GRAND (25)","25804",null,null,null,null,null,null,"0925529001",3000,"Collectivité"]
["SANIFRANCE (IDEAL STANDARD) (DOLE 39 )","17269W","Entrée station","Sortie station",null,null,null,null,null,null,"Industrie"]
["SANOFI (SISTERON 04)","14295","Entrée station","Sortie station","Eaux refroidi-ssement",null,null,null,null,null,"Industrie","01-002"]
["SANOFI CHIMIE (ARAMON 30)","16103","Entrée station","Sortie station","Rejet Rhône",null,null,null,null,null,"Industrie","88-007"]
["SANOFI CHIMIE (NEUVILLE S/SAONE 69)","77438",null,null,null,null,null,null,null,null,"Industrie","89-002"]
["SANOFI-PASTEUR (MARCY L'ETOILE 69)","17973",null,null,null,null,null,null,null,null,"Industrie","96-004"]
["SANTA MARIA POGGIO MURIANINCU (20)","20924",null,null,null,null,null,null,"0920311001",10000,"Collectivité"]
["SANTENAY (21)","21810",null,null,null,null,null,null,"0921582002",8300,"Collectivité"]
["SAONE (25)","25949",null,null,null,null,null,null,"0925532001",5500,"Collectivité"]
["SARI DI PORTOVECCHIO SOLARO (20)","20918",null,null,null,null,null,null,"0920269001",5000,"Collectivité"]
["SARL ECLIPSE (ST MARTIN DE VILLEREGLAN 11)","63379",null,null,null,null,null,null,null,null,"Industrie","SRR-09003"]
["SARRIANS (84)","84122",null,null,null,null,null,null,"0984122001",23000,"Collectivité"]
["SARTENE - TIZZANO (20)","75255",null,null,null,null,null,null,"0920272003",2300,"Collectivité"]
["SARTENE (20)","75255",null,null,null,null,null,null,"0920272001",6000,"Collectivité"]
["SATILLIEU (07)","07309",null,null,null,null,null,null,"0907309003",2000,"Collectivité"]
["SAULON LA CHAPELLE (21)","21932",null,null,null,null,null,null,"0921585001",2300,"Collectivité"]
["SAUSSAN (34)","34926",null,null,null,null,null,null,"0934295002",2000,"Collectivité"]
["SAUSSET LES PINS (13)","13939",null,null,null,null,null,null,"0913104003",26000,"Collectivité"]
["SAUVE (30)","30311",null,null,null,null,null,null,"0930311001",2500,"Collectivité"]
["SAUVERNY VERSONNEX (01)","01990",null,null,null,null,null,null,"0901435002",5800,"Collectivité"]
["SAUVETERRE (30)","30312",null,null,null,null,null,null,"0930312001",3000,"Collectivité"]
["SAUVIAN (34)","34988",null,null,null,null,null,null,"0934298001",3300,"Collectivité"]
["SAVINES LE LAC - CHEF-LIEU (05)","05164",null,null,null,null,null,null,"0905164001",3000,"Collectivité"]
["SAZE (30)","84943",null,null,null,null,null,null,"0930315002",3000,"Collectivité"]
["SCA DISTILLATION LA CAVALE (LIMOUX 11)",null,null,null,null,null,null,null,null,null,"Industrie"]
["SCA VALDEZE (LA TOUR D'AIGUES 84)","19748",null,null,null,null,null,null,null,null,"Industrie","SRR-"]
["SCATV COOP. LEDENON (LEDENON 30)",null,"Rejet Usine",null,null,null,null,null,null,null,"Industrie"]
["SCAV COTEAUX AIGALIERS (FOISSAC 30 )","16171C","Entrée station","Sortie station",null,null,null,null,null,null,"Industrie"]
["SEB (IS SUR TILLE 21)","15447R","Sortie station",null,null,null,null,null,null,null,"Industrie"]
["SEB SAS (IS SUR TILLE 21)","15447",null,null,null,null,null,null,null,null,"Industrie","SRR-"]
["SEEZ (73)","73285",null,null,null,null,null,null,"0973285001",2500,"Collectivité"]
["SEILLANS VILLAGE (83)","83124",null,null,null,null,null,null,"0983124003",3100,"Collectivité"]
["SEILLONS SOURCE D ARGENS (83)","83125",null,null,null,null,null,null,"0983125002",2000,"Collectivité"]
["SELONGEY (21)","21599",null,null,null,null,null,null,"0921599001",3300,"Collectivité"]
["SELONNET - VILLAGE (04)","04203",null,null,null,null,null,null,"0904203002",2000,"Collectivité"]
["SEMAE  (L’ISLE SUR SORGUE 84)",null,"Entrée Rousselot","Entrée Commune","Sortie station",null,null,null,null,null,"Industrie"]
["SENAS (13)","13940",null,null,null,null,null,null,"0913105002",6000,"Collectivité"]
["SENNECEY LE GRAND VIELMOULIN (71)","71512",null,null,null,null,null,null,"0971512005",3000,"Collectivité"]
["SEPR (LE PONTET 84)","19709",null,null,null,null,null,null,null,null,"Industrie","SRR-10019"]
["SEPTEME (38)","38802","Sortie station","Entrée station","Sortie intermédiaire",null,null,null,"0938480001",null,"Collectivité"]
["SEPTMONCEL (39)","39974",null,null,null,null,null,null,"0939510002",6200,"Collectivité"]
["SERIGNAN DU COMTAT (84)","84127",null,null,null,null,null,null,"0984127001",2200,"Collectivité"]
["SERIGNAN LES AIROULES (34)","34988",null,null,null,null,null,null,"0934299002",53000,"Collectivité"]
["SERRA DI FERRO PORTO POLLO (20)","20276",null,null,null,null,null,null,"0920276001",6500,"Collectivité"]
["SERRES - CHEF-LIEU (05)","05166",null,null,null,null,null,null,"0905166001",2500,"Collectivité"]
["SERRIGNY LADOIX (21)","21810",null,null,null,null,null,null,"0921606001",3200,"Collectivité"]
["SERVIAN (34)","34988",null,null,null,null,null,null,"0934300002",2100,"Collectivité"]
["SETE (34)","34992","Entrée SETE","Entrée Frontignan","Entrée Balaruc","Sortie 1","Sortie 2","By-pass","0934301001",135000,"Collectivité"]
["SEURRE (21)","21914",null,null,null,null,null,null,"0921607001",4100,"Collectivité"]
["SEVENANS (90)","90903",null,null,null,null,null,null,"0990094001",3600,"Collectivité"]
["SEYNE LES ALPES (04)","04205",null,null,null,null,null,null,"0904205001",4200,"Collectivité"]
["SFS INTEC (VALENCE 26)","16061H","Sortie station",null,null,null,null,null,null,null,"Industrie"]
["SFS INTEC (VALENCE 26)","16061",null,null,null,null,null,null,null,null,"Industrie","SRR-"]
["SHELL PETROCHIMIE – ENTITE CHIMIE - (BERRE L’ETANG 13)","14908E","Effluents Nord","Effluents Sud","UC Aubette","Sortie tertiaire","Rejet Global",null,null,null,"Industrie"]
["SHELL PETROCHIMIE ENTITE RAFFINERIE (BERRE L’ETANG 13)","46668B","Entrée station","Sortie station",null,null,null,null,null,null,"Industrie"]
["SIA PAYS D'ALBON (26)","26805","Entrée station","Sortie station",null,null,null,null,null,null,"Collectivité"]
["SIGEAN (11)","11379",null,null,null,null,null,null,"0911379001",6000,"Collectivité"]
["SIGNAUX GIROD","17229C ","Sortie station",null,null,null,null,null,null,null,"Industrie"]
["SIGNES - PARC D'ACTIVITES (83)","83938",null,null,null,null,null,null,"0983127002",4000,"Collectivité"]
["SILAC (CHAMPLITTE 70)","22962J","Sortie station",null,null,null,null,null,null,null,"Industrie"]
["SIRA (CHASSE S/RHONE 38)",null,null,null,null,null,null,null,null,null,"Industrie"]
["SISTERON (04)","04209",null,null,null,null,null,null,"0904209001",8000,"Collectivité"]
["SMFF (FONTAINE FRANCAISE 21 )",null,"Sortie station",null,null,null,null,null,null,null,"Industrie"]
["SMURFIT KAPPA PAPIER RECYCLE (LE PONTET 84)","72361",null,null,null,null,null,null,null,null,"Industrie","SRR-08004"]
["SNDCE (SENNECEY LE GRAND 71 )","19931P","Sortie station",null,null,null,null,null,null,null,"Industrie"]
["SNET (STE NATIONALE D'ELECTRICITE THERMIQUE) (MEYREUIL 13)","72913",null,null,null,null,null,null,null,null,"Industrie","SRR-10004"]
["Société FROMAGERE DU LAIT CRU (EQUEVILLEY 70)","18411M","Entrée station","Sortie station",null,null,null,null,null,null,"Industrie"]
["Société Laitière d’Argis (TENAY 01)",null,"Entrée station","Sortie station",null,null,null,null,null,null,"Industrie"]
["Société LAITIERE DES HAUTS DE SAVOIE (FRANGY 74)",null,"Entrée station","Sortie station",null,null,null,null,null,null,"Industrie"]
["Société Nouvelle de Fromagerie (St Triviers de Courtes 01)",null,"Sortie Fromagerie","Entrée station","Sortie station",null,null,null,null,null,"Industrie"]
["SOCIMET (SEURRE 21 )","28955Y","Sortie station",null,null,null,null,null,null,null,"Industrie"]
["SOFTAL (NUITS ST GEORGES 21 )","24916H","Sortie station",null,null,null,null,null,null,null,"Industrie"]
["SOLECO (L'ISLE SUR SORGUE 84)","35956","Eaux SOLECO","Eaux SOCOPA","Sortie station",null,null,null,null,null,"Industrie","SRR-12003"]
["SOLLAC  (FOS SUR MER 13)","14931E","Rejet principal","Rejet acierie","Entrée station","Sortie Lagune B",null,null,null,null,"Industrie"]
["SOLVAY (SALIN DE GIRAUD 13)","14885",null,null,null,null,null,null,null,null,"Industrie","SRR-08006"]
["SOLVAY (TAVAUX 39)","17411",null,null,null,null,null,null,null,null,"Industrie","00-005"]
["SOLVAY France (TAVAUX 39)","17411A","Entrée Bassin","Entrée EPI","Entrée DCE","Sortie station","Sortie Aillon",null,null,null,"Industrie"]
["SOLVAY S.A. (SALINS DE GIRAUD 13)","14885E","Entrée station","Sortie station",null,null,null,null,null,null,"Industrie"]
["SOMMIERES (30)","30832",null,null,null,null,null,null,"0930321001",6000,"Collectivité"]
["SOMOGAL (GRAY 70)","18377A","Sortie station",null,null,null,null,null,null,null,"Industrie"]
["SORGUES (84)","84917",null,null,null,null,null,null,"0984129001",41000,"Collectivité"]
["SOSPEL (06)","06136",null,null,null,null,null,null,"0906136001",5200,"Collectivité"]
["SOYONS (07)","07316",null,null,null,null,null,null,"0907316001",2000,"Collectivité"]
["SPANGHERO VIANDES (CASTELNAUDARY 11 )","33890M","Rejet abattoir","Rejet Salaison","Sortie station",null,null,null,null,null,"Industrie"]
["SPIRAL (LE PONT DE CLAIX 38)","62214Z","Rejet Enichem","Entrée STDEN","Rejet général","Sortie STDER",null,null,null,null,"Industrie"]
["SPIT (BOURG LES VALENCE 26)","15887",null,null,null,null,null,null,null,null,"Industrie","SRR-12007"]
["ST GOBAIN (LAGNIEU 01 )","31825T","Sortie station",null,null,null,null,null,null,null,"Industrie"]
["ST LAURENT (69)",null,"Entrée station","Sortie intermédiaire","Sortie station",null,null,null,null,null,"Collectivité"]
["ST LAURENT DU VAR (06)","06909","Entrée station","Sortie station","Déversoir","By-pass",null,null,"0906123001",80000,"Collectivité"]
["ST LOUIS SUCRE (MARSEILLE 13)","55508",null,null,null,null,null,null,null,null,"Industrie","SRR-"]
["ST PIERRE DE CHARTREUSE (38)","38442","Sortie station",null,null,null,null,null,"0938442001",2700,"Collectivité"]
["ST VICTOR DE CESSIEU (38)","38937","Sortie station",null,null,null,null,null,"0938464001",null,"Collectivité"]
["STAHL SAS (SAINT CLAIR DU RHONE 38)",null,"Entrée station","Rejet général",null,null,null,null,null,null,"Industrie"]
["STATION D'EPURATION MIXTE AOSTE (38)","16798",null,null,null,null,null,null,"0938012801",6000,"Collectivité"]
["STATION D'ÉPURATION MIXTE ARKEMA (04)","24644",null,null,null,null,null,null,"0904049802",8000,"Collectivité"]
["STATION D'EPURATION MIXTE DE LAITERIE DE BRESSE (71)","72801",null,null,null,null,null,null,"0971558803",3500,"Collectivité"]
["STATION D'EPURATION MIXTE DISTILLERIE CAP SUD PUICHERIC (11)","14816",null,null,null,null,null,null,"0911301801",16500,"Collectivité"]
["STATION D'EPURATION MIXTE EUROSERUM (71)","18685",null,null,null,null,null,null,"0971448802",20000,"Collectivité"]
["STATION D'EPURATION MIXTE FROMAGERIE DE LEYMENT (01)","14136",null,null,null,null,null,null,"0901213801",6000,"Collectivité"]
["STATION D'EPURATION MIXTE SA VICTOR JANODY (01)","35646",null,null,null,null,null,null,"0901336800",4500,"Collectivité"]
["STATION D'EPURATION MIXTE SISTERON - ZAC VAL DE DURANCE (04)","04209",null,null,null,null,null,null,"0904209804",13000,"Collectivité"]
["STATION D'EPURATION MIXTE ZI DE ROUSSET (13)","13087",null,null,null,null,null,null,"0913087809",2000,"Collectivité"]
["STE D'EXPLOITATION DE L'ABATTOIR (SISTERON 04 )",null,"Entrée station","Sortie station",null,null,null,null,null,null,"Industrie"]
["STE LAITIERE DES HAUTS DE SAVOIE (MUSIEGES 74)","32200",null,null,null,null,null,null,null,null,"Industrie","SRR-"]
["STEP DE L'ISLE SUR SORGUE - SAAE (L'ISLE SUR SORGUE 84)","43562",null,null,null,null,null,null,null,null,"Industrie","00-004"]
["STEP de ROUSSET (ROUSSET 13)","19999N","F2 ATMEL FAB 7","F2 ST 2000","F1 ATMEL FAB7","F1 ST 2000","F1 ST 6","Sortie station",null,null,"Industrie"]
["STEP de ROUSSET (ROUSSET 13) suite",null,"F4 ELIS","EAUX TRAITEES",null,null,null,null,null,null,"Industrie"]
["STEP SIGNES (SIGNES 83 )","64619N","Entrée station","Sortie station",null,null,null,null,null,null,"Industrie"]
["STMICROELECTRONICS SA","40059","Sortie station",null,null,null,null,null,null,null,"Industrie"]
["STMICROELECTRONICS SA (CROLLES 38)","40059",null,null,null,null,null,null,null,null,"Industrie","SRR-10013"]
["SUCREN (CANET 34)",null,"Entrée station","Sortie station",null,null,null,null,null,null,"Industrie"]
["SUMENE (30)","30325",null,null,null,null,null,null,"0930325001",2500,"Collectivité"]
["SUSSARGUES (34)","34926",null,null,null,null,null,null,"0934307001",2000,"Collectivité"]
["SYNDICAT MIXTE DE LA PLAINE DE L’AIN DEVELOPPEMENT (SAINT VULBAS 01)","01960F","Sortie tampon","Sortie station",null,null,null,null,null,null,"Industrie"]
["SYNDICAT MIXTE PLAINE AIN (ST VULBAS 01)","01960",null,null,null,null,null,null,null,null,"Industrie","02-001"]
["SYNERGIE CAD (CARROS 06)","29527V","Sortie station",null,null,null,null,null,null,null,"Industrie"]
["SYNGENTA (AIGUES VIVES 30)","54045V","Entrée station","Sortie station",null,null,null,null,null,null,"Industrie"]
["SYNGENTA PRODUCTION FRANCE (AIGUES VIVES 30)","54045",null,null,null,null,null,null,null,null,"Industrie","88-016"]
["TAIN L'HERMITAGE (26)","26347","Entrée station","Sortie station",null,null,null,null,"0926347001",17500,"Collectivité"]
["TALLARD (05)","05916",null,null,null,null,null,null,"0905170002",3700,"Collectivité"]
["TANINGES - CHEF LIEU (74)","74276",null,null,null,null,null,null,"0974276001",5200,"Collectivité"]
["TANNERIE VALEIX","16410","Entrée station","Sortie station",null,null,null,null,null,null,"Industrie"]
["TARARE (69)","69243","Entrée station","Sortie station","Déversoir","By-pass Entrée","By-pass Intermédiaire",null,"0969243001",63000,"Collectivité"]
["TARASCON (13)","13942",null,null,null,null,null,null,"0913108001",10000,"Collectivité"]
["TARGASSONNE (66)","66923","Sortie station",null,null,null,null,null,"0966202001",2500,"Collectivité"]
["TAVAUX (39)","39526",null,null,null,null,null,null,"0939526002",4200,"Collectivité"]
["TAVEL-LIRAC (30)","30918",null,null,null,null,null,null,"0930326001",3800,"Collectivité"]
["TEAMPACK (SORGUES 84 )","46988Z","Entrée station","Sortie station",null,null,null,null,null,null,"Industrie"]
["TEC SAS (SASSENAGE 38 )","37998C","Sortie station",null,null,null,null,null,null,null,"Industrie"]
["TECHCI RHONE ALPES (ST GENIX SUR GUIERS 73)","37267",null,null,null,null,null,null,null,null,"Industrie","SRR-"]
["TEFAL (RUMILLY 74)","19203",null,null,null,null,null,null,null,null,"Industrie","SRR-10017"]
["TEFAL (TOURNUS 71 )","36264T","Sortie station",null,null,null,null,null,null,null,"Industrie"]
["TEISSEIRE (CROLLES 38)","16864","Rejet usine",null,null,null,null,null,null,null,"Industrie","94-004"]
["TEMBEC (TARASCON 13)","15213","Eaux acides","Eaux alcalines","Sortie station",null,null,null,null,null,"Industrie","01-001"]
["THEOULE SUR MER - MIRAMAR (06)","75238",null,null,null,null,null,null,"0906138001",4000,"Collectivité"]
["THERMOCOMPACT THERMOWIRE (PRINGY 74)","19149",null,null,null,null,null,null,null,null,"Industrie","SRR-12002"]
["THEZAN LES BEZIERS - CHEF LIEU (34)","34310",null,null,null,null,null,null,"0934310001",3000,"Collectivité"]
["THIZY - BOURG (69)","69970",null,null,null,null,null,null,"0969248001",17400,"Collectivité"]
["THOISSEY (01)","01998",null,null,null,null,null,null,"0901420001",4000,"Collectivité"]
["THOMSON TUBES ET DISPLAY (GENLIS 21)","10604B","Sortie station",null,null,null,null,null,null,null,"Industrie"]
["THONES (74)",null,null,null,null,null,null,null,"0974280001",8900,"Collectivité"]
["THONES VERNAIES (74)","74980",null,null,null,null,null,null,"0974280002",19500,"Collectivité"]
["THONON (74)","74919","Entrée Evian","Entrée Globale","Sortie","By-pass",null,null,"0974281001",160000,"Collectivité"]
["THUIR (66)","66977",null,null,null,null,null,null,"0966210002",15000,"Collectivité"]
["TIES (CHAMPAGNEUX 73)","77811",null,null,null,null,null,null,null,null,"Industrie","99-004"]
["TIGNES LE LAC (73)","73296",null,null,null,null,null,null,"0973296001",27000,"Collectivité"]
["TIGNES LES BREVIERES (73)","73296",null,null,null,null,null,null,"0973296002",4100,"Collectivité"]
["TIL (VILLEFRANCHE 69 )","32177A","Entrée tampon","Sortie tampon",null,null,null,null,null,null,"Industrie"]
["TORAY PLASTICS EUROPE (SAINT MAURICE DE BEYNOST 01)","14215B","Entrée station","Sortie station",null,null,null,null,null,null,"Industrie"]
["TORREILLES (66)","66966",null,null,null,null,null,null,"0966212001",16000,"Collectivité"]
["TOTAL France (FEYZIN 69)","18292H","Rejet général",null,null,null,null,null,null,null,"Industrie"]
["TOTAL Raffinerie Provence (CHATEAUNEUF LES MARTIGUES 13)","14917P","Entrée station","Sortie station",null,null,null,null,null,null,"Industrie"]
["TOULON - EST (83)","83910","Entrée station","Sortie station","By-pass entrée","Sortie prétraitement",null,null,"0983062001",107000,"Collectivité"]
["TOULON CAP - SICIE (83)","83916","Entrée station","Sortie station","Sortie lavage","Sortie dessablage 1","Sortie dessablage 2",null,"0983126001",500000,"Collectivité"]
["TOURBES (34)","34311",null,null,null,null,null,null,"0934311001",2200,"Collectivité"]
["TOURETTE SUR LOUP (06)","06148",null,null,null,null,null,null,"0906148001",2000,"Collectivité"]
["TOURNON (07)","07324",null,null,null,null,null,null,"0907324001",28000,"Collectivité"]
["TOURNUS (71)","71543",null,null,null,null,null,null,"0971543001",8000,"Collectivité"]
["TOURRETTES (83)","83138",null,null,null,null,null,null,"0983138002",5000,"Collectivité"]
["TOURVES (83)","83140",null,null,null,null,null,null,"0983140002",4000,"Collectivité"]
["TPC (BEAUNES 21 )",null,"Entrée station","Sortie station",null,null,null,null,null,null,"Industrie"]
["TRAMOYES (01)","01424",null,null,null,null,null,null,"0901424002",2500,"Collectivité"]
["TRANS EN PROVENCE - DRAGUIGNAN (83)","83950",null,null,null,null,null,null,"0983141001",70000,"Collectivité"]
["TRANSERVICE (CHALON S/SAONE 71 )",null,"Sortie station",null,null,null,null,null,null,null,"Industrie"]
["TREBES (11)","11397",null,null,null,null,null,null,"0911397002",8000,"Collectivité"]
["TREDI (SALAISE SUR SANNE 38)","29621","Entrée station","Sortie station",null,null,null,null,null,null,"Industrie","SRR-08007"]
["TREDI PEC ST VULBAS (ST VULBAS 01)","22858",null,null,null,null,null,null,null,null,"Industrie","07-001"]
["TREFILERIES DE CONFLANDEY (CONFLANDEY 70)","18400A","Sortie station",null,null,null,null,null,null,null,"Industrie"]
["TREFILERIES DE PORT D'ATELIER (PORT D'ATELIER 70)","18400A(bis)","Sortie station",null,null,null,null,null,null,null,"Industrie"]
["TRELLEBORG AIRAX (CHEMAUDIN 25)","27216H","Sortie station",null,null,null,null,null,null,null,"Industrie"]
["TRETS (13)","13110",null,null,null,null,null,null,"0913110002",6000,"Collectivité"]
["TREVILLERS - THIEBOUHANS (25)","25571","Sortie station",null,null,null,null,null,"0925571001",2300,"Collectivité"]
["TREVOUX (01)","01814",null,null,null,null,null,null,"0901427001",14400,"Collectivité"]
["TRILLES (MAUREILHAN 34)","16550P","Entrée station","Sortie station",null,null,null,null,null,null,"Industrie"]
["TROUILLAS (66)","66977",null,null,null,null,null,null,"0966217002",2000,"Collectivité"]
["TUCHAN (11)","11401",null,null,null,null,null,null,"0911401001",2000,"Collectivité"]
["TULLINS LA FURE (38)","38809",null,null,null,null,null,null,"0938517002",29000,"Collectivité"]
["U.I.O.M. LYON SUD (LYON 69)","69901E","Entrée station","Sortie station",null,null,null,null,null,null,"Industrie"]
["UCHAUD (30)","30333",null,null,null,null,null,null,"0930333002",6000,"Collectivité"]
["UGINE (73)","73303",null,null,null,null,null,null,"0973303001",12000,"Collectivité"]
["UGINE SAVOIE IMPHY (UGINE 73)","18920R","Sortie station",null,null,null,null,null,null,null,"Industrie"]
["UGITECH (UGINE 73)","18920",null,null,null,null,null,null,null,null,"Industrie","SRR-09017"]
["UIOM DU SILA (ANNECY 74 )","29556B","Entrée station","Sortie station",null,null,null,null,null,null,"Industrie"]
["UNION DES DISTILLERIES DE MEDITERRANEE (OLONZAC 34)","87578",null,null,null,null,null,null,null,null,"Industrie","SRR-10001"]
["UNION DES DISTILLERIES DE MEDITERRANEE (VAUVERT 30)","87579",null,null,null,null,null,null,null,null,"Industrie","SRR-10023"]
["UNION GRAP'SUD (LA CRAU 83)","78551",null,null,null,null,null,null,null,null,"Industrie","SRR-08019"]
["UNISOURCE (NISSAN LES ENSERUNE 34)","43935F","Entrée station","Sortie station","Rejet communal",null,null,null,null,null,"Industrie"]
["UZES (30)","30334",null,null,null,null,null,null,"0930334002",29000,"Collectivité"]
["VACHERESSE (74)","74286",null,null,null,null,null,null,"0974286001",2200,"Collectivité"]
["VAILHAUQUES (34)","34320",null,null,null,null,null,null,"0934320002",2000,"Collectivité"]
["VAISON LA ROMAINE (84)","84137",null,null,null,null,null,null,"0984137002",20000,"Collectivité"]
["VAL D'AJOL (88)","88487",null,null,null,null,null,null,"060988487001",3950,"Collectivité"]
["VAL D'ISERE (73)","73304",null,null,null,null,null,null,"0973304001",27000,"Collectivité"]
["VALBERG (06)","06902",null,null,null,null,null,null,"0906094005",9000,"Collectivité"]
["VALBONNE - BOUILLIDES (06)","06932",null,null,null,null,null,null,"0906152002",26000,"Collectivité"]
["VALDAHON (25)","25578",null,null,null,null,null,null,"0925578001",14500,"Collectivité"]
["VALDEBLORE (06)","06153",null,null,null,null,null,null,"0906153001",2000,"Collectivité"]
["VALENCE (26)","26362","Entrée station","Sortie station","Sortie Densadeg 1","Sortie Densadeg 2","By-pass",null,"0926362001",150000,"Collectivité"]
["VALENSOLE (04)","04230",null,null,null,null,null,null,"0904230001",3000,"Collectivité"]
["VALERGUES (34)","34910",null,null,null,null,null,null,"0934321001",2000,"Collectivité"]
["VALFOND DELLE (DELLE 90)",null,null,null,null,null,null,null,null,null,"Industrie"]
["VALLABREGUES - NOUVELLE (30)","30336",null,null,null,null,null,null,"0930336002",2000,"Collectivité"]
["VALLAURIS (06)","06155",null,null,null,null,null,null,"0906155001",45000,"Collectivité"]
["VALLERAUGUE (30)","30339",null,null,null,null,null,null,"0930339001",2500,"Collectivité"]
["VALLOIRE - CALYPSO (73)","73943",null,null,null,null,null,null,"0973306002",37000,"Collectivité"]
["VALLON PONT D'ARC (07)","07330",null,null,null,null,null,null,"0907330001",7000,"Collectivité"]
["VALLOUISE (05)","05911",null,null,null,null,null,null,"0905175001",22000,"Collectivité"]
["VALORLY (RILLIEUX 69)","32225","Entrée station","Sortie station",null,null,null,null,null,null,"Industrie","SRR-11012"]
["VALREAS (84)","84138",null,null,null,null,null,null,"0984138001",20000,"Collectivité"]
["VALS LES BAINS (07)","10025",null,null,null,null,null,null,"0907331001",6000,"Collectivité"]
["VARANGES -TART LE BAS-MARLIE (21)","21937",null,null,null,null,null,null,"0921656001",2000,"Collectivité"]
["VARENNES LES MACON (71)","71556",null,null,null,null,null,null,"0971556001",2700,"Collectivité"]
["VAROISE DE CONCENTRES (SIGNES 83 )","33499M","Entrée station","Sortie station",null,null,null,null,null,null,"Industrie"]
["VARS (05)","05910",null,null,null,null,null,null,"0905177001",23000,"Collectivité"]
["VAUVERT (30)","30341",null,null,null,null,null,null,"0930341002",15000,"Collectivité"]
["VELLERON VILLAGE (84)","84943",null,null,null,null,null,null,"0984142002",2800,"Collectivité"]
["VENCE NORD - VOSGESLADE (06)","06953",null,null,null,null,null,null,"0906157002",12000,"Collectivité"]
["VENCE SUD - MALVAN (06)","06953","Entrée STDEN","Sortie STDER","Rejet général","Entrée STDEN","Sortie STDER","Rejet général","0906157003",10000,"Collectivité"]
["VENCOREX (LE-PONT-DE-CLAIX 38)","85078",null,null,null,null,null,null,null,null,"Industrie"]
["VENDARGUES (34)","34926",null,null,null,null,null,null,"0934327002",7500,"Collectivité"]
["VENDRES - ZONE LITTORALE (34)","34329",null,null,null,null,null,null,"0934329002",8000,"Collectivité"]
["VENELLES - SUD (13)","77731",null,null,null,null,null,null,"0913113001",8000,"Collectivité"]
["VENTISERI TRAVO (20)","20342",null,null,null,null,null,null,"0920342001",7500,"Collectivité"]
["VERCEL (25)","25601",null,null,null,null,null,null,"0925601001",15500,"Collectivité"]
["VERDANNET (FILLINGES 74)","45607Y","Entrée station","Sortie station",null,null,null,null,null,null,"Industrie"]
["VERNET LES BAINS - CORNEILLA (66)","66976",null,null,null,null,null,null,"0966222001",9000,"Collectivité"]
["VERNOSC LES ANNONAY (07)","07337",null,null,null,null,null,null,"0907337001",2500,"Collectivité"]
["VERNOUX EN VIVARAIS (07)","07922",null,null,null,null,null,null,"0907338003",4500,"Collectivité"]
["VERRIERES DE JOUX (25)","25992",null,null,null,null,null,null,"0925609001",2300,"Collectivité"]
["VESOUL - NOUVELLE (70)","70964",null,null,null,null,null,null,"0970428001",72000,"Collectivité"]
["VESOUL (70)",null,null,null,null,null,null,null,"0970513001",37000,"Collectivité"]
["VETOQUINOL (LURE 70)","18468",null,null,null,null,null,null,null,null,"Industrie","SRR-10008"]
["VEYNES (05)","05179",null,null,null,null,null,null,"0905179001",5500,"Collectivité"]
["VIC LA GARDIOLE (34)","34992",null,null,null,null,null,null,"0934333002",4000,"Collectivité"]
["VICAT PAP VIZILLE (VIZILLE 38)","27892",null,null,null,null,null,null,null,null,"Industrie","SRR-11013"]
["VICTOR JANODY (SAINT ANDRE SUR VIEUX JONC 01)","35646",null,null,null,null,null,null,null,null,"Industrie"]
["VIDAUBAN - CHEF LIEU (83)","83148",null,null,null,null,null,null,"0983148001",5400,"Collectivité"]
["VIENNE - REVENTIN VAUGRIS (38)","38819","Entrée station","Sortie station","By-pass",null,null,null,"0938336001",72000,"Collectivité"]
["VILLARD DE LANS - FENAT (38)","38972",null,null,null,null,null,null,"0938548001",41000,"Collectivité"]
["VILLARD SUR DORON BEAUFORTAIN (73)","73999",null,null,null,null,null,null,"0973317002",33000,"Collectivité"]
["VILLAREMBERT LE CORBIER (73)","73952",null,null,null,null,null,null,"0973318001",16700,"Collectivité"]
["VILLARS LES DOMBES - ETANG (01)","01443",null,null,null,null,null,null,"0901443002",6000,"Collectivité"]
["VILLE DU PONT (25)","25978",null,null,null,null,null,null,"0925620001",3000,"Collectivité"]
["VILLEFORT (48)","48198",null,null,null,null,null,null,"0948198001",2500,"Collectivité"]
["VILLEFRANCHE SUR SAONE (69)","69926","Entrée station","Sortie station","By-pass",null,null,null,"0969264001",130000,"Collectivité"]
["VILLEGAILHENC (11)","11425",null,null,null,null,null,null,"0911425002",2100,"Collectivité"]
["VILLELAURE (84)","84905",null,null,null,null,null,null,"0984147002",3000,"Collectivité"]
["VILLELONGUE DE LA SALANQUE (66)",null,null,null,null,null,null,null,"0966224001",2300,"Collectivité"]
["VILLEMOLAQUE - AUTOROUTE (66)","66977","Sortie station",null,null,null,null,null,"0966226002",3500,"Collectivité"]
["VILLEMOUSTAUSSOU (11)","11429",null,null,null,null,null,null,"0911429001",3000,"Collectivité"]
["VILLENEUVE (04)","04937",null,null,null,null,null,null,"0904242002",3200,"Collectivité"]
["VILLENEUVE DE BERG (07)","07341",null,null,null,null,null,null,"0907341002",5000,"Collectivité"]
["VILLENEUVE DE LA RAHO - ??? (66)","66966",null,null,null,null,null,null,"0966227002",8000,"Collectivité"]
["VILLENEUVE DE LA RAHO (66)",null,null,null,null,null,null,null,"0966227001",5100,"Collectivité"]
["VILLENEUVE LES AVIGNON (30)",null,null,null,null,null,null,null,"0930351001",16200,"Collectivité"]
["VILLENEUVE LES MAGUELONNE (34)","34926",null,null,null,null,null,null,"0934337001",12000,"Collectivité"]
["VILLEREVERSURE - CHEF LIEU (01)","01810","Entrée station","Sortie station",null,null,null,null,"0901447002",2000,"Collectivité"]
["VILLERS LE LAC (25)","25948",null,null,null,null,null,null,"0925321001",5700,"Collectivité"]
["VILLERS SA (VIZILLE 21)","72232",null,null,null,null,null,null,null,null,"Industrie","SRR-"]
["VILLERSEXEL (70)","70561",null,null,null,null,null,null,"0970561001",2000,"Collectivité"]
["VILLES SUR AUZON (84)","84903",null,null,null,null,null,null,"0984148002",2100,"Collectivité"]
["VILLEVEYRAC (34)","34978",null,null,null,null,null,null,"0934341001",3500,"Collectivité"]
["VILLIEU MOLLON - CHEF LIEU (01)","01450",null,null,null,null,null,null,"0901450004",3000,"Collectivité"]
["VINCA (66)","66978",null,null,null,null,null,null,"0966230001",3000,"Collectivité"]
["VINON SUR VERDON (83)","83150",null,null,null,null,null,null,"0983150001",3800,"Collectivité"]
["VIRE (71)","71978",null,null,null,null,null,null,"0971584001",2000,"Collectivité"]
["VIRIAT - LES BAISSES (01)","01451",null,null,null,null,null,null,"0901451002",6500,"Collectivité"]
["VIRIEU (38)","38937","Sortie station",null,null,null,null,null,"0938560001",11700,"Collectivité"]
["VIRY (74)","74917","Sortie station",null,null,null,null,null,"0974309001",2500,"Collectivité"]
["VITROLLES (13)","13117","Entrée station","Sortie station",null,null,null,null,"0913117001",60000,"Collectivité"]
["VIVIERS SUD ILE DES PERRIERS (07)","07346",null,null,null,null,null,null,"0907346001",2900,"Collectivité"]
["VMC PECHE (MORVILLARS 90 )","24518A","Sortie station",null,null,null,null,null,null,null,"Industrie"]
["VOIRON - AGGLOMERATION (38)","38955","Entrée station","Sortie station 1","Sortie station 2",null,null,null,"0938239002",55000,"Collectivité"]
["VOLONNE (04)","04244",null,null,null,null,null,null,"0904244001",3500,"Collectivité"]
["VOLX (04)","04937",null,null,null,null,null,null,"0904245001",3500,"Collectivité"]
["VOSNE ROMANEE FLAGEY ECHEZAUX (21)","72794",null,null,null,null,null,null,"0921714001",12000,"Collectivité"]
["VOUREY LES DEVEZ (38)","38955",null,null,null,null,null,null,"0938566001",6000,"Collectivité"]
["WILLIAM SAURIN (SAINT MARCEL 71)","18682G","Rejet usine",null,null,null,null,null,null,null,"Industrie"]
["XERTIGNY (88)","88530",null,null,null,null,null,null,"0988530001",2600,"Collectivité"]
["YENNE (73)","73330",null,null,null,null,null,null,"0973330001",5000,"Collectivité"]
["ZINDEL (SELONCOURT 25)","72180",null,null,null,null,null,null,null,null,"Industrie","SRR-13002"]
["ZONZA - SAINTE LUCIE (20)","20918",null,null,null,null,null,null,"0920362002",20000,"Collectivité"]
["ZUBER RIEDER (BOUSSIERES 25)","15609S","Entrée station","Sortie station",null,null,null,null,null,null,"Industrie"]
["ZUEGG FRANCE (ELNIA) (ELNE 66)","44311P",null,null,null,null,null,null,null,null,"Industrie"]

{"sheet":"SynthèseContrôle","index":1,"n_rows":27,"n_cols":6,"rows_kept":27,"cut":false,"hidden":false,"merged":[[26,2,26,3],[14,1,14,2],[14,3,14,4],[13,3,13,4],[17,3,17,4],[17,1,17,2],[18,2,18,3],[22,2,22,3],[23,2,23,3],[24,2,24,3],[21,2,21,3],[19,2,19,4],[12,1,12,2],[13,1,13,2],[16,3,16,4],[12,3,12,4],[16,1,16,2],[15,1,15,2],[15,3,15,4],[9,3,9,5],[10,3,10,5],[11,1,11,4],[1,1,3,5],[5,1,5,2],[6,1,6,2],[7,1,7,2],[8,1,8,2],[5,3,5,5],[6,3,6,5],[7,3,7,5],[8,3,8,5],[9,1,9,2],[10,1,10,2]]}
[]
[null,"DIAGNOSTIC DE FONCTIONNEMENT D'UN DISPOSITIF DE SUIVI REGULIER DES REJETS ET DE MESURE DE LA POLLUTION EVITEE PAR UN OUVRAGE DE DEPOLLUTION "]
[]
[]
[]
[null,"Coordonnées de l'établissement : "]
[null,"Code agence de l'eau : "]
[null,"Date ou Numéro d'agrément SRR : "]
[null,"Date d'intervention : "]
[null,"Organisme de contrôle : "]
[null,"Laboratoire(s) de contrôle : "]
[null,"Dénomination des points de suivi régulier des rejets\n et de mesure de la pollution évitée par un ouvrage de dépollution",null,null,null,"SRR"]
[null,"Point 1 : "]
[null,"Point 2 : "]
[null,"Point 3 : "]
[null,"Point 4 : "]
[null,"Point 5 : "]
[null,"Point 6 : "]
[]
[null,null,"SYNTHESE DES COTATIONS"]
[]
[null,null,"1 - Cotation des dispositifs de mesure de débit (sur 10) ",null,{"$f":"IF(ISERR(AVERAGE(CotationDispositifs!L14:W14,CotationDispositifs!L25:W25)),\"\",AVERAGE(CotationDispositifs!L14:W14,CotationDispositifs!L25:W25))","v":""}]
[null,null,"2 - Cotation des dispositifs de prélèvement (sur 10) ",null,{"$f":"IF(ISERR(AVERAGE(CotationDispositifs!L37:W37)),\"\",AVERAGE(CotationDispositifs!L37:W37))","v":""}]
[null,null,"3 - Cotation du comparatif analytique (sur 10) ",null,{"$f":"AnalysesComparatives!Q25","v":0}]
[null,null,"4 - Existe-t-il un système qualité performant et les résultats analytiques sont ils déposés selon le scénario d'échange en vigueur (coeff 0,9 ou 1)",null,"Oui"]
[]
[null,null,"Cotation globale = Moyenne (1 + 2 + 3) x 4 (sur 10) ",null,{"$f":"IF(ISERR(AVERAGE(E22:E24)),\"\",IF(E25=\"Oui\",AVERAGE(E22:E24),AVERAGE(E22:E24)*0.9))","v":0}]

{"sheet":"CotationDispositifs","index":2,"n_rows":39,"n_cols":23,"rows_kept":39,"cut":false,"hidden":false,"merged":[[21,10,23,10],[24,1,24,10],[36,1,36,10],[34,2,34,9],[1,11,1,12],[22,2,22,9],[12,2,12,9],[23,2,23,9],[29,2,29,9],[35,2,35,9],[30,2,30,9],[33,2,33,9],[32,2,32,9],[28,1,28,9],[31,2,31,9],[18,2,18,9],[1,13,1,14],[1,21,1,22],[24,19,24,20],[24,21,24,22],[2,17,2,18],[13,13,13,14],[13,15,13,16],[13,17,13,18],[13,21,13,22],[1,15,1,16],[1,17,1,18],[1,19,1,20],[24,15,24,16],[24,17,24,18],[36,15,36,16],[36,17,36,18],[13,11,13,12],[2,15,2,16],[24,13,24,14],[2,13,2,14],[36,13,36,14],[2,11,2,12],[24,11,24,12],[36,11,36,12],[16,11,16,12],[16,13,16,14],[16,15,16,16],[16,17,16,18],[36,19,36,20],[36,21,36,22],[2,19,2,20],[2,21,2,22],[13,19,13,20],[16,19,16,20],[16,21,16,22],[1,8,2,10],[20,2,20,9],[4,2,4,9],[5,2,5,9],[6,2,6,9],[7,2,7,9],[13,1,13,10],[3,1,3,9],[1,1,2,7],[21,2,21,9],[17,1,17,9],[8,2,8,9],[9,2,9,9],[10,2,10,9],[11,2,11,9],[16,2,16,9],[19,2,19,9]]}
[]
[null,{"$f":"SynthèseContrôle!D6 & \" le\"","v":" le"},null,null,null,null,null,null,{"$f":"SynthèseContrôle!D9","v":"00:00:00"},null,null,{"$f":"IF(SynthèseContrôle!$F$13=\"\",\"Point 1\",\"Point 1 (SRR)\")","v":"Point 1"},null,{"$f":"IF(SynthèseContrôle!$F$14=\"\",\"Point 2\",\"Point 2 (SRR)\")","v":"Point 2"},null,{"$f":"IF(SynthèseContrôle!$F$15=\"\",\"Point 3\",\"Point 3 (SRR)\")","v":"Point 3"},null,{"$f":"IF(SynthèseContrôle!$F$15=\"\",\"Point 4\",\"Point 4 (SRR)\")","v":"Point 4"},null,{"$f":"IF(SynthèseContrôle!$F$17=\"\",\"Point 5\",\"Point 5 (SRR)\")","v":"Point 5"},null,{"$f":"IF(SynthèseContrôle!$F$18=\"\",\"Point 6\",\"Point 6 (SRR)\")","v":"Point 6"}]
[null,null,null,null,null,null,null,null,null,null,null,{"$f":"IF(ISBLANK(SynthèseContrôle!$D$13),\"\",SynthèseContrôle!$D$13)","v":""},null,{"$f":"IF(ISBLANK(SynthèseContrôle!$D$14),\"\",SynthèseContrôle!$D$14)","v":""},null,{"$f":"IF(ISBLANK(SynthèseContrôle!$D$15),\"\",SynthèseContrôle!$D$15)","v":""},null,{"$f":"IF(ISBLANK(SynthèseContrôle!$D$16),\"\",SynthèseContrôle!$D$16)","v":""},null,{"$f":"IF(ISBLANK(SynthèseContrôle!$D$17),\"\",SynthèseContrôle!$D$17)","v":""},null,{"$f":"IF(ISBLANK(SynthèseContrôle!$D$18),\"\",SynthèseContrôle!$D$18)","v":""}]
[null,"Mesure de débit en écoulement à surface libre",null,null,null,null,null,null,null,null,"Coef.","Oui","Non","Oui","Non","Oui","Non","Oui","Non","Oui","Non","Oui","Non"]
[null,1,"Le dimensionnement de l'organe de mesure vis-à-vis de l'étendue des débits à mesurer, y compris celui des canaux d'approche et de fuite, sont-ils conformes aux normes en vigueur et/ou aux prescriptions des constructeurs ?",null,null,null,null,null,null,null,5]
[null,2,"La planéité et l'horizontalité de l'organe de mesure, y compris pour les canaux d'approche et de fuite, sont-elles conformes aux normes en vigueur et/ou aux prescriptions des constructeurs ?",null,null,null,null,null,null,null,5]
[null,3,"L'étanchéité, la propreté et l'état d'entretien de l'organe de mesure, y compris ceux des canaux d'approche et de fuite, sont-ils satisfaisants ?",null,null,null,null,null,null,null,1]
[null,4,"Le fonctionnement hydraulique de l'organe de mesure, en amont et en aval, est-il satisfaisant ?",null,null,null,null,null,null,null,5]
[null,5,"Le capteur de mesure est-il adapté au type d'effluent et à l'environnement rencontrés (mousses, température, etc..) et présente t-il un état de propreté satisfaisant ?",null,null,null,null,null,null,null,2]
[null,6,"L'implantation du capteur respecte t-elle les normes en vigueur et/ou les prescriptions des constructeurs ? ",null,null,null,null,null,null,null,1]
[null,7,"Existe t-il un système de contrôle adapté de la hauteur d'eau et/ou du débit ?",null,null,null,null,null,null,null,1]
[null,8,"La loi hydraulique Q = f (h) utilisée, est-elle cohérente avec les caractéristiques de l'organe de mesure ?",null,null,null,null,null,null,null,5]
[null,9,"L'écart (*) entre d'une part les résultats de mesures obtenus à partir des dispositifs en place et ceux mesurés par l'organisme de contrôle d'autre part est-il :\n     ≤ à 10% pour un volume mesuré ≤ à 50 m3 ?\n     ≤ à 5% pour un volume mesuré > à 50 m3 par un organe calibré ?\nPour les débits < 10 m3, le fonctionnement sera alors apprécié par l'opérateur.",null,null,null,null,null,null,null,10]
[null,"Résultat de la cotation sur 10 è",null,null,null,null,null,null,null,null,null,{"$f":"IF(AND(ISNA(LOOKUP(\"X\",L5:L13)),ISNA(LOOKUP(\"X\",M5:M13))),\"\",SUMPRODUCT((L5:L13=\"X\")*($K$5:$K$13))/3.5)","v":""},null,{"$f":"IF(AND(ISNA(LOOKUP(\"X\",N5:N13)),ISNA(LOOKUP(\"X\",O5:O13))),\"\",SUMPRODUCT((N5:N13=\"X\")*($K$5:$K$13))/3.5)","v":""},null,{"$f":"IF(AND(ISNA(LOOKUP(\"X\",P5:P13)),ISNA(LOOKUP(\"X\",Q5:Q13))),\"\",SUMPRODUCT((P5:P13=\"X\")*($K$5:$K$13))/3.5)","v":""},null,{"$f":"IF(AND(ISNA(LOOKUP(\"X\",R5:R13)),ISNA(LOOKUP(\"X\",S5:S13))),\"\",SUMPRODUCT((R5:R13=\"X\")*($K$5:$K$13))/3.5)","v":""},null,{"$f":"IF(AND(ISNA(LOOKUP(\"X\",T5:T13)),ISNA(LOOKUP(\"X\",U5:U13))),\"\",SUMPRODUCT((T5:T13=\"X\")*($K$5:$K$13))/3.5)","v":""},null,{"$f":"IF(AND(ISNA(LOOKUP(\"X\",V5:V13)),ISNA(LOOKUP(\"X\",W5:W13))),\"\",SUMPRODUCT((V5:V13=\"X\")*($K$5:$K$13))/3.5)","v":""}]
[]
[null,"(*) Calcul de l'écart par rapport à la moyenne des 2 valeurs"]
[null,null,null,null,null,null,null,null,null,null,null,{"$f":"IF(L19=\"X\",$K19,0)","v":0},null,{"$f":"IF(N19=\"X\",$K19,0)","v":0},null,{"$f":"IF(P19=\"X\",$K19,0)","v":0},null,{"$f":"IF(R19=\"X\",$K19,0)","v":0},null,{"$f":"IF(T19=\"X\",$K19,0)","v":0},null,{"$f":"IF(V19=\"X\",$K19,0)","v":0}]
[null,"Mesure de débit en écoulement en charge",null,null,null,null,null,null,null,null,"Coef.","Oui","Non","Oui","Non","Oui","Non","Oui","Non","Oui","Non","Oui","Non"]
[null,1,"Le débitmètre est-il adapté vis à vis de l'étendue des débits à mesurer, est-il installé conformément aux normes en vigueur et/ou aux prescriptions du constructeur, le report éventuel de la mesure s'effectue t-il correctement ?",null,null,null,null,null,null,null,5]
[null,"2a","Si une mesure comparative est possible, l'écart (*) entre les résultats de mesures obtenus sur le point de mesure et de manière déportée d'une part, et par l'organisme de contrôle d'autre part, est il ≤  à 5 % ?",null,null,null,null,null,null,null,5]
[null,"2b","Si une mesure comparative est possible, l'écart (*) entre les résultats de mesures obtenus sur le point de mesure et de manière déportée d'une part, et par l'organisme de contrôle d'autre part, est il > 10 % ?",null,null,null,null,null,null,null,0]
[null,3,"Si une mesure comparative est impossible ou que l'écart se situe entre 5 et 10% et qu'un bilan eau (entrée / sortie  ou autre) peut-être établi (**), est-il cohérent (≤ 10 %) ?",null,null,null,null,null,null,null,5]
[null,4,"Si une mesure comparative est impossible ou que l'écart se situe entre 5 et 10% et qu'un contrôle de fonctionnement du débitmètre est assuré, le rapport d'intervention atteste t-il d'un bon fonctionnement du débitmètre ?"]
[null,5,"Si une mesure comparative est impossible ou que l'écart se situe entre 5 et 10% et qu'un étalonnage du débitmètre par un laboratoire accrédité est réalisé, l'incertitude de mesure du débitmètre est-elle conforme aux prescriptions du constructeur ?"]
[null,"Résultat de la cotation sur 10 è",null,null,null,null,null,null,null,null,null,{"$f":"IF(AND(ISNA(LOOKUP(\"X\",L19:L24)),ISNA(LOOKUP(\"X\",M19:M24))),\"\",IF(ISNA(LOOKUP(\"X\",L19:L24)),0,IF(L20=\"X\",$K20+L17,IF(L21=\"X\",L17,IF(AND(L22=\"X\",L23=\"X\"),$K22+L17,IF(AND(L23=\"X\",L24=\"X\"),$K22+L17,IF(L24=\"X\",$K22+L17,L17)))))))","v":""},null,{"$f":"IF(AND(ISNA(LOOKUP(\"X\",N19:N24)),ISNA(LOOKUP(\"X\",O19:O24))),\"\",IF(ISNA(LOOKUP(\"X\",N19:N24)),0,IF(N20=\"X\",$K20+N17,IF(N21=\"X\",N17,IF(AND(N22=\"X\",N23=\"X\"),$K22+N17,IF(AND(N23=\"X\",N24=\"X\"),$K22+N17,IF(N24=\"X\",$K22+N17,N17)))))))","v":""},null,{"$f":"IF(AND(ISNA(LOOKUP(\"X\",P19:P24)),ISNA(LOOKUP(\"X\",Q19:Q24))),\"\",IF(ISNA(LOOKUP(\"X\",P19:P24)),0,IF(P20=\"X\",$K20+P17,IF(P21=\"X\",P17,IF(AND(P22=\"X\",P23=\"X\"),$K22+P17,IF(AND(P23=\"X\",P24=\"X\"),$K22+P17,IF(P24=\"X\",$K22+P17,P17)))))))","v":""},null,{"$f":"IF(AND(ISNA(LOOKUP(\"X\",R19:R24)),ISNA(LOOKUP(\"X\",S19:S24))),\"\",IF(ISNA(LOOKUP(\"X\",R19:R24)),0,IF(R20=\"X\",$K20+R17,IF(R21=\"X\",R17,IF(AND(R22=\"X\",R23=\"X\"),$K22+R17,IF(AND(R23=\"X\",R24=\"X\"),$K22+R17,IF(R24=\"X\",$K22+R17,R17)))))))","v":""},null,{"$f":"IF(AND(ISNA(LOOKUP(\"X\",T19:T24)),ISNA(LOOKUP(\"X\",U19:U24))),\"\",IF(ISNA(LOOKUP(\"X\",T19:T24)),0,IF(T20=\"X\",$K20+T17,IF(T21=\"X\",T17,IF(AND(T22=\"X\",T23=\"X\"),$K22+T17,IF(AND(T23=\"X\",T24=\"X\"),$K22+T17,IF(T24=\"X\",$K22+T17,T17)))))))","v":""},null,{"$f":"IF(AND(ISNA(LOOKUP(\"X\",V19:V24)),ISNA(LOOKUP(\"X\",W19:W24))),\"\",IF(ISNA(LOOKUP(\"X\",V19:V24)),0,IF(V20=\"X\",$K20+V17,IF(V21=\"X\",V17,IF(AND(V22=\"X\",V23=\"X\"),$K22+V17,IF(AND(V23=\"X\",V24=\"X\"),$K22+V17,IF(V24=\"X\",$K22+V17,V17)))))))","v":""}]
[]
[null,"(**) Calcul de l'écart selon la formule (Volume Entrée - Volume Sortie) / Volume Moyen"]
[]
[null,"Dispositifs de Prélèvement",null,null,null,null,null,null,null,null,"Coef.","Oui","Non","Oui","Non","Oui","Non","Oui","Non","Oui","Non","Oui","Non"]
[null,1,"Le point de prélèvement est-il correctement implanté et situé dans un milieu homogène et brassé ?",null,null,null,null,null,null,null,2]
[null,2,"Le circuit de prélèvement, y compris la boucle primaire, présente t-il un état de fonctionnement satisfaisant, son diamètre est-il ≥ à 9 mm ?",null,null,null,null,null,null,null,1]
[null,3,"Le volume de prélèvement par cycle est-il > à 50 ml et est-il répétable à ± 5 % ?",null,null,null,null,null,null,null,1]
[null,4,"La vitesse d'aspiration, y compris celle de la boucle primaire, est-elle ≥ à 0,5 m/s ?",null,null,null,null,null,null,null,1]
[null,5,"Le préleveur est-il asservi au débit, ou au volume écoulé, assure-t-il un nombre de prélèvements égal, en moyenne, au moins à 4 (***) par heure de rejet effectif ? Les horaires de prélèvement et de totalisation des débits sont-ils synchronisés ?",null,null,null,null,null,null,null,2]
[null,6,"La température de l'enceinte de prélèvement est-elle adaptée? Si elle est réfrigérée, sa température est-elle maîtrisée à 5°C ± 3°C ?",null,null,null,null,null,null,null,2]
[null,7,"L'écart entre le volume théorique et le volume prélevé est-il ≤ à 10% ?",null,null,null,null,null,null,null,3]
[null,"Résultat de la cotation sur 10 è",null,null,null,null,null,null,null,null,null,{"$f":"IF(AND(ISNA(LOOKUP(\"X\",L30:L36)),ISNA(LOOKUP(\"X\",M30:M36))),\"\",SUMPRODUCT((L30:L36=\"X\")*($K$30:$K$36))/1.2)","v":""},null,{"$f":"IF(AND(ISNA(LOOKUP(\"X\",N30:N36)),ISNA(LOOKUP(\"X\",O30:O36))),\"\",SUMPRODUCT((N30:N36=\"X\")*($K$30:$K$36))/1.2)","v":""},null,{"$f":"IF(AND(ISNA(LOOKUP(\"X\",P30:P36)),ISNA(LOOKUP(\"X\",Q30:Q36))),\"\",SUMPRODUCT((P30:P36=\"X\")*($K$30:$K$36))/1.2)","v":""},null,{"$f":"IF(AND(ISNA(LOOKUP(\"X\",R30:R36)),ISNA(LOOKUP(\"X\",S30:S36))),\"\",SUMPRODUCT((R30:R36=\"X\")*($K$30:$K$36))/1.2)","v":""},null,{"$f":"IF(AND(ISNA(LOOKUP(\"X\",T30:T36)),ISNA(LOOKUP(\"X\",U30:U36))),\"\",SUMPRODUCT((T30:T36=\"X\")*($K$30:$K$36))/1.2)","v":""},null,{"$f":"IF(AND(ISNA(LOOKUP(\"X\",V30:V36)),ISNA(LOOKUP(\"X\",W30:W36))),\"\",SUMPRODUCT((V30:V36=\"X\")*($K$30:$K$36))/1.2)","v":""}]
[]
[null,"(***) La préconisation est à 6 prélèvement par heure effective de rejet et la tolérance de validation à 4"]

{"sheet":"AnalysesComparatives","index":3,"n_rows":84,"n_cols":20,"rows_kept":84,"cut":false,"hidden":false,"merged":[[9,16,9,17],[18,16,18,17],[19,16,20,17],[24,16,24,17],[1,1,1,19],[2,8,2,19],[3,8,3,19],[5,1,5,15],[18,1,18,15],[2,1,2,7],[3,1,3,7],[5,16,5,17],[6,16,6,17],[7,16,7,17],[8,16,8,17],[55,14,55,19],[55,2,55,7],[55,8,55,13],[26,2,26,7],[26,8,26,13],[26,14,26,19]]}
[]
[null,"COMPARATIF ANALYTIQUE"]
[null,"Les analyses de l'établissement sont réalisées par :"]
[null,"Les analyses de contrôle ont été réalisées par :",null,null,null,null,null,null,{"$f":"SynthèseContrôle!D11","v":0}]
[]
[null,"Les échantillons sont-ils constitués, conservés et mis en analyse, selon les règles de l'art en vigueur ?",null,null,null,null,null,null,null,null,null,null,null,null,null,null,"Pénalité (5)"]
[null,null,null,null,null,null,null,null,null,null,null,null,"Le guide AQUAREF est-il respecté pour le prélèvement des échantillons SDE (1) ?",null,"Non Concerné",null,{"$f":"IF(O7=\"\",\"\",IF(O7=\"Non\",0.1,0))","v":0}]
[null,null,null,null,null,null,null,null,null,null,null,null,"Les échantillons sont-ils fractionnés sous agitation mécanique (2) ?",null,"MES<60mg/L",null,{"$f":"IF(O8=\"\",\"\",IF(O8=\"Non\",0.1,0))","v":0}]
[null,null,null,null,null,null,null,null,null,null,null,null,"La conservation et le transport des échantillons est-il assuré à 5°C ±3 (3) ?",null,"Oui",null,0]
[null,null,null,null,null,null,null,null,null,null,null,null,"Les analyses sont-elles mises en œuvre sous 24 h (4) ?",null,"Oui",null,0]
[]
[null,null,null,"(1) Tuyau d'aspiration en téflon et bocaux en verre"]
[null,null,null,"(2) Tolérance pour les points de rejet industriels si la concentration en MES est inférieure à 60 mg/l"]
[null,null,null,"(3) Regarder les conditions de stockage et les bulletins d'analyses"]
[null,null,null,"(3) Regarder les conditions de stockage sur site et la température des enceintes de stockage notée sur les bulletins d'analyses"]
[null,null,null,"(4) A défaut, tenir compte de la stabilisation ou de la congélation éventuelle des échantillons"]
[null,null,null,"(5) Si Non, la cotation analytique est réduite de 10% pour chaque question"]
[]
[null,"Les analyses sont elles correctement effectuées ?",null,null,null,null,null,null,null,null,null,null,null,null,null,null,"Coef. (6)"]
[null,null,null,null,null,null,null,null,null,null,null,null,"Nombre d'analyses ayant fait l'objet d'un comparatif :",null,{"$f":"COUNTIF(H29:H52,\"Oui\")+COUNTIF(N29:N52,\"Oui\")+COUNTIF(T29:T52,\"Oui\")+COUNTIF(H58:H81,\"Oui\")+COUNTIF(N58:N81,\"Oui\")+COUNTIF(T58:T81,\"Oui\")+COUNTIF(H29:H52,\"Non\")+COUNTIF(N29:N52,\"Non\")+COUNTIF(T29:T52,\"Non\")+COUNTIF(H58:H81,\"Non\")+COUNTIF(N58:N81,\"Non\")+COUNTIF(T58:T81,\"Non\")","v":0},null,{"$f":"IF(O20=0,0,ROUND(O21/O20*10,1))","v":0}]
[null,null,null,null,null,null,null,null,null,null,null,null,"Nombre de résultats analytiques conformes :",null,{"$f":"COUNTIF(H29:H52,\"Oui\")+COUNTIF(N29:N52,\"Oui\")+COUNTIF(T29:T52,\"Oui\")+COUNTIF(H58:H81,\"Oui\")+COUNTIF(N58:N81,\"Oui\")+COUNTIF(T58:T81,\"Oui\")","v":0}]
[]
[null,null,null,"(6) En l'absence de réception des résultats analytiques de l'industriel sous 3 semaines, le coefficient est forcé à 0"]
[]
[null,null,null,null,null,null,null,null,null,null,null,null,"Résultat de la cotation sur 10 :",null,"è",null,{"$f":"IF(O20>=0,Q20*(1-SUM(Q7:Q10)),10)","v":0}]
[]
[null,"Paramètres",{"$f":"IF(SynthèseContrôle!$F$13=\"\",\"Point 1\",\"Point 1 (SRR)\")","v":"Point 1"},null,null,null,null,null,{"$f":"IF(SynthèseContrôle!$F$14=\"\",\"Point 2\",\"Point 2 (SRR)\")","v":"Point 2"},null,null,null,null,null,{"$f":"IF(SynthèseContrôle!$F$15=\"\",\"Point 3\",\"Point 3 (SRR)\")","v":"Point 3"}]
[null,"Concentration\nen mg/l ","Etablissement","COFRAC","Labo\n de contrôle","COFRAC","Ecart (%)","Conformité","Etablissement","COFRAC","Labo\n de contrôle","COFRAC","Ecart (%)","Conformité","Etablissement","COFRAC","Labo\n de contrôle","COFRAC","Ecart (%)","Conformité"]
[null,"DBO5",null,null,null,null,{"$f":"IF(OR(E29=\"\",C29=\"\"),\"\",IF(ISERROR(VLOOKUP($B29,'SeuilsComparaison-EMT'!$C$5:$J$24,4,FALSE)),\"-\",IF(OR(IF(ISTEXT(E29)=TRUE,SUBSTITUTE(E29,\"<\",\"\",1)*1,E29)>VLOOKUP($B29,'SeuilsComparaison-EMT'!$C$5:$J$24,4,FALSE),IF(ISTEXT(C29)=TRUE,SUBSTITUTE(C29,\"<\",\"\",1)*1,C29)>VLOOKUP($B29,'SeuilsComparaison-EMT'!$C$5:$J$24,4,FALSE)=TRUE),(IF(ISTEXT(C29)=TRUE,SUBSTITUTE(C29,\"<\",\"\",1)*1,C29)-((IF(ISTEXT(C29)=TRUE,SUBSTITUTE(C29,\"<\",\"\",1)*1,C29)+IF(ISTEXT(E29)=TRUE,SUBSTITUTE(E29,\"<\",\"\",1)*1,E29))/2))/((IF(ISTEXT(C29)=TRUE,SUBSTITUTE(C29,\"<\",\"\",1)*1,C29)+IF(ISTEXT(E29)=TRUE,SUBSTITUTE(E29,\"<\",\"\",1),E29))/2),\"-\")))","v":""},{"$f":"IF(OR(E29=\"\",C29=\"\"),\"\",IF(AND(D29=\"Oui\",F29=\"Oui\"),\"Oui\",IF(G29=\"-\",\"Oui\",IF(OR(E29>VLOOKUP($B29,'SeuilsComparaison-EMT'!$C$5:$J$24,4,FALSE),C29>VLOOKUP($B29,'SeuilsComparaison-EMT'!$C$5:$J$24,4,FALSE)=TRUE),IF(C29<=VLOOKUP($B29,'SeuilsComparaison-EMT'!$C$5:$J$24,5,FALSE),IF(ABS(G29)<=VLOOKUP($B29,'SeuilsComparaison-EMT'!$C$5:$J$24,6,FALSE),\"Oui\",\"Non\"),IF(ABS(G29)<=VLOOKUP($B29,'SeuilsComparaison-EMT'!$C$5:$J$24,8,FALSE),\"Oui\",\"Non\")),\"Oui\"))))","v":""},null,null,null,null,{"$f":"IF(OR(K29=\"\",I29=\"\"),\"\",IF(ISERROR(VLOOKUP($B29,'SeuilsComparaison-EMT'!$C$5:$J$24,4,FALSE)),\"-\",IF(OR(IF(ISTEXT(K29)=TRUE,SUBSTITUTE(K29,\"<\",\"\",1)*1,K29)>VLOOKUP($B29,'SeuilsComparaison-EMT'!$C$5:$J$24,4,FALSE),IF(ISTEXT(I29)=TRUE,SUBSTITUTE(I29,\"<\",\"\",1)*1,I29)>VLOOKUP($B29,'SeuilsComparaison-EMT'!$C$5:$J$24,4,FALSE)=TRUE),(IF(ISTEXT(I29)=TRUE,SUBSTITUTE(I29,\"<\",\"\",1)*1,I29)-((IF(ISTEXT(I29)=TRUE,SUBSTITUTE(I29,\"<\",\"\",1)*1,I29)+IF(ISTEXT(K29)=TRUE,SUBSTITUTE(K29,\"<\",\"\",1)*1,K29))/2))/((IF(ISTEXT(I29)=TRUE,SUBSTITUTE(I29,\"<\",\"\",1)*1,I29)+IF(ISTEXT(K29)=TRUE,SUBSTITUTE(K29,\"<\",\"\",1),K29))/2),\"-\")))","v":""},{"$f":"IF(OR(K29=\"\",I29=\"\"),\"\",IF(AND(J29=\"Oui\",L29=\"Oui\"),\"Oui\",IF(M29=\"-\",\"Oui\",IF(OR(K29>VLOOKUP($B29,'SeuilsComparaison-EMT'!$C$5:$J$24,4,FALSE),I29>VLOOKUP($B29,'SeuilsComparaison-EMT'!$C$5:$J$24,4,FALSE)=TRUE),IF(I29<=VLOOKUP($B29,'SeuilsComparaison-EMT'!$C$5:$J$24,5,FALSE),IF(ABS(M29)<=VLOOKUP($B29,'SeuilsComparaison-EMT'!$C$5:$J$24,6,FALSE),\"Oui\",\"Non\"),IF(ABS(M29)<=VLOOKUP($B29,'SeuilsComparaison-EMT'!$C$5:$J$24,8,FALSE),\"Oui\",\"Non\")),\"Oui\"))))","v":""},null,null,null,null,{"$f":"IF(OR(Q29=\"\",O29=\"\"),\"\",IF(ISERROR(VLOOKUP($B29,'SeuilsComparaison-EMT'!$C$5:$J$24,4,FALSE)),\"-\",IF(OR(IF(ISTEXT(Q29)=TRUE,SUBSTITUTE(Q29,\"<\",\"\",1)*1,Q29)>VLOOKUP($B29,'SeuilsComparaison-EMT'!$C$5:$J$24,4,FALSE),IF(ISTEXT(O29)=TRUE,SUBSTITUTE(O29,\"<\",\"\",1)*1,O29)>VLOOKUP($B29,'SeuilsComparaison-EMT'!$C$5:$J$24,4,FALSE)=TRUE),(IF(ISTEXT(O29)=TRUE,SUBSTITUTE(O29,\"<\",\"\",1)*1,O29)-((IF(ISTEXT(O29)=TRUE,SUBSTITUTE(O29,\"<\",\"\",1)*1,O29)+IF(ISTEXT(Q29)=TRUE,SUBSTITUTE(Q29,\"<\",\"\",1)*1,Q29))/2))/((IF(ISTEXT(O29)=TRUE,SUBSTITUTE(O29,\"<\",\"\",1)*1,O29)+IF(ISTEXT(Q29)=TRUE,SUBSTITUTE(Q29,\"<\",\"\",1),Q29))/2),\"-\")))","v":""},{"$f":"IF(OR(Q29=\"\",O29=\"\"),\"\",IF(AND(P29=\"Oui\",R29=\"Oui\"),\"Oui\",IF(S29=\"-\",\"Oui\",IF(OR(Q29>VLOOKUP($B29,'SeuilsComparaison-EMT'!$C$5:$J$24,4,FALSE),O29>VLOOKUP($B29,'SeuilsComparaison-EMT'!$C$5:$J$24,4,FALSE)=TRUE),IF(O29<=VLOOKUP($B29,'SeuilsComparaison-EMT'!$C$5:$J$24,5,FALSE),IF(ABS(S29)<=VLOOKUP($B29,'SeuilsComparaison-EMT'!$C$5:$J$24,6,FALSE),\"Oui\",\"Non\"),IF(ABS(S29)<=VLOOKUP($B29,'SeuilsComparaison-EMT'!$C$5:$J$24,8,FALSE),\"Oui\",\"Non\")),\"Oui\"))))","v":""}]
[null,"DCO",null,null,null,null,{"$f":"IF(OR(E30=\"\",C30=\"\"),\"\",IF(ISERROR(VLOOKUP($B30,'SeuilsComparaison-EMT'!$C$5:$J$24,4,FALSE)),\"-\",IF(OR(IF(ISTEXT(E30)=TRUE,SUBSTITUTE(E30,\"<\",\"\",1)*1,E30)>VLOOKUP($B30,'SeuilsComparaison-EMT'!$C$5:$J$24,4,FALSE),IF(ISTEXT(C30)=TRUE,SUBSTITUTE(C30,\"<\",\"\",1)*1,C30)>VLOOKUP($B30,'SeuilsComparaison-EMT'!$C$5:$J$24,4,FALSE)=TRUE),(IF(ISTEXT(C30)=TRUE,SUBSTITUTE(C30,\"<\",\"\",1)*1,C30)-((IF(ISTEXT(C30)=TRUE,SUBSTITUTE(C30,\"<\",\"\",1)*1,C30)+IF(ISTEXT(E30)=TRUE,SUBSTITUTE(E30,\"<\",\"\",1)*1,E30))/2))/((IF(ISTEXT(C30)=TRUE,SUBSTITUTE(C30,\"<\",\"\",1)*1,C30)+IF(ISTEXT(E30)=TRUE,SUBSTITUTE(E30,\"<\",\"\",1),E30))/2),\"-\")))","v":""},{"$f":"IF(OR(E30=\"\",C30=\"\"),\"\",IF(AND(D30=\"Oui\",F30=\"Oui\"),\"Oui\",IF(G30=\"-\",\"Oui\",IF(OR(E30>VLOOKUP($B30,'SeuilsComparaison-EMT'!$C$5:$J$24,4,FALSE),C30>VLOOKUP($B30,'SeuilsComparaison-EMT'!$C$5:$J$24,4,FALSE)=TRUE),IF(C30<=VLOOKUP($B30,'SeuilsComparaison-EMT'!$C$5:$J$24,5,FALSE),IF(ABS(G30)<=VLOOKUP($B30,'SeuilsComparaison-EMT'!$C$5:$J$24,6,FALSE),\"Oui\",\"Non\"),IF(ABS(G30)<=VLOOKUP($B30,'SeuilsComparaison-EMT'!$C$5:$J$24,8,FALSE),\"Oui\",\"Non\")),\"Oui\"))))","v":""},null,null,null,null,{"$f":"IF(OR(K30=\"\",I30=\"\"),\"\",IF(ISERROR(VLOOKUP($B30,'SeuilsComparaison-EMT'!$C$5:$J$24,4,FALSE)),\"-\",IF(OR(IF(ISTEXT(K30)=TRUE,SUBSTITUTE(K30,\"<\",\"\",1)*1,K30)>VLOOKUP($B30,'SeuilsComparaison-EMT'!$C$5:$J$24,4,FALSE),IF(ISTEXT(I30)=TRUE,SUBSTITUTE(I30,\"<\",\"\",1)*1,I30)>VLOOKUP($B30,'SeuilsComparaison-EMT'!$C$5:$J$24,4,FALSE)=TRUE),(IF(ISTEXT(I30)=TRUE,SUBSTITUTE(I30,\"<\",\"\",1)*1,I30)-((IF(ISTEXT(I30)=TRUE,SUBSTITUTE(I30,\"<\",\"\",1)*1,I30)+IF(ISTEXT(K30)=TRUE,SUBSTITUTE(K30,\"<\",\"\",1)*1,K30))/2))/((IF(ISTEXT(I30)=TRUE,SUBSTITUTE(I30,\"<\",\"\",1)*1,I30)+IF(ISTEXT(K30)=TRUE,SUBSTITUTE(K30,\"<\",\"\",1),K30))/2),\"-\")))","v":""},{"$f":"IF(OR(K30=\"\",I30=\"\"),\"\",IF(AND(J30=\"Oui\",L30=\"Oui\"),\"Oui\",IF(M30=\"-\",\"Oui\",IF(OR(K30>VLOOKUP($B30,'SeuilsComparaison-EMT'!$C$5:$J$24,4,FALSE),I30>VLOOKUP($B30,'SeuilsComparaison-EMT'!$C$5:$J$24,4,FALSE)=TRUE),IF(I30<=VLOOKUP($B30,'SeuilsComparaison-EMT'!$C$5:$J$24,5,FALSE),IF(ABS(M30)<=VLOOKUP($B30,'SeuilsComparaison-EMT'!$C$5:$J$24,6,FALSE),\"Oui\",\"Non\"),IF(ABS(M30)<=VLOOKUP($B30,'SeuilsComparaison-EMT'!$C$5:$J$24,8,FALSE),\"Oui\",\"Non\")),\"Oui\"))))","v":""},null,null,null,null,{"$f":"IF(OR(Q30=\"\",O30=\"\"),\"\",IF(ISERROR(VLOOKUP($B30,'SeuilsComparaison-EMT'!$C$5:$J$24,4,FALSE)),\"-\",IF(OR(IF(ISTEXT(Q30)=TRUE,SUBSTITUTE(Q30,\"<\",\"\",1)*1,Q30)>VLOOKUP($B30,'SeuilsComparaison-EMT'!$C$5:$J$24,4,FALSE),IF(ISTEXT(O30)=TRUE,SUBSTITUTE(O30,\"<\",\"\",1)*1,O30)>VLOOKUP($B30,'SeuilsComparaison-EMT'!$C$5:$J$24,4,FALSE)=TRUE),(IF(ISTEXT(O30)=TRUE,SUBSTITUTE(O30,\"<\",\"\",1)*1,O30)-((IF(ISTEXT(O30)=TRUE,SUBSTITUTE(O30,\"<\",\"\",1)*1,O30)+IF(ISTEXT(Q30)=TRUE,SUBSTITUTE(Q30,\"<\",\"\",1)*1,Q30))/2))/((IF(ISTEXT(O30)=TRUE,SUBSTITUTE(O30,\"<\",\"\",1)*1,O30)+IF(ISTEXT(Q30)=TRUE,SUBSTITUTE(Q30,\"<\",\"\",1),Q30))/2),\"-\")))","v":""},{"$f":"IF(OR(Q30=\"\",O30=\"\"),\"\",IF(AND(P30=\"Oui\",R30=\"Oui\"),\"Oui\",IF(S30=\"-\",\"Oui\",IF(OR(Q30>VLOOKUP($B30,'SeuilsComparaison-EMT'!$C$5:$J$24,4,FALSE),O30>VLOOKUP($B30,'SeuilsComparaison-EMT'!$C$5:$J$24,4,FALSE)=TRUE),IF(O30<=VLOOKUP($B30,'SeuilsComparaison-EMT'!$C$5:$J$24,5,FALSE),IF(ABS(S30)<=VLOOKUP($B30,'SeuilsComparaison-EMT'!$C$5:$J$24,6,FALSE),\"Oui\",\"Non\"),IF(ABS(S30)<=VLOOKUP($B30,'SeuilsComparaison-EMT'!$C$5:$J$24,8,FALSE),\"Oui\",\"Non\")),\"Oui\"))))","v":""}]
[null,"ST DCO",null,null,null,null,{"$f":"IF(OR(E31=\"\",C31=\"\"),\"\",IF(ISERROR(VLOOKUP($B31,'SeuilsComparaison-EMT'!$C$5:$J$24,4,FALSE)),\"-\",IF(OR(IF(ISTEXT(E31)=TRUE,SUBSTITUTE(E31,\"<\",\"\",1)*1,E31)>VLOOKUP($B31,'SeuilsComparaison-EMT'!$C$5:$J$24,4,FALSE),IF(ISTEXT(C31)=TRUE,SUBSTITUTE(C31,\"<\",\"\",1)*1,C31)>VLOOKUP($B31,'SeuilsComparaison-EMT'!$C$5:$J$24,4,FALSE)=TRUE),(IF(ISTEXT(C31)=TRUE,SUBSTITUTE(C31,\"<\",\"\",1)*1,C31)-((IF(ISTEXT(C31)=TRUE,SUBSTITUTE(C31,\"<\",\"\",1)*1,C31)+IF(ISTEXT(E31)=TRUE,SUBSTITUTE(E31,\"<\",\"\",1)*1,E31))/2))/((IF(ISTEXT(C31)=TRUE,SUBSTITUTE(C31,\"<\",\"\",1)*1,C31)+IF(ISTEXT(E31)=TRUE,SUBSTITUTE(E31,\"<\",\"\",1),E31))/2),\"-\")))","v":""},{"$f":"IF(OR(E31=\"\",C31=\"\"),\"\",IF(AND(D31=\"Oui\",F31=\"Oui\"),\"Oui\",IF(G31=\"-\",\"Oui\",IF(OR(E31>VLOOKUP($B31,'SeuilsComparaison-EMT'!$C$5:$J$24,4,FALSE),C31>VLOOKUP($B31,'SeuilsComparaison-EMT'!$C$5:$J$24,4,FALSE)=TRUE),IF(C31<=VLOOKUP($B31,'SeuilsComparaison-EMT'!$C$5:$J$24,5,FALSE),IF(ABS(G31)<=VLOOKUP($B31,'SeuilsComparaison-EMT'!$C$5:$J$24,6,FALSE),\"Oui\",\"Non\"),IF(ABS(G31)<=VLOOKUP($B31,'SeuilsComparaison-EMT'!$C$5:$J$24,8,FALSE),\"Oui\",\"Non\")),\"Oui\"))))","v":""},null,null,null,null,{"$f":"IF(OR(K31=\"\",I31=\"\"),\"\",IF(ISERROR(VLOOKUP($B31,'SeuilsComparaison-EMT'!$C$5:$J$24,4,FALSE)),\"-\",IF(OR(IF(ISTEXT(K31)=TRUE,SUBSTITUTE(K31,\"<\",\"\",1)*1,K31)>VLOOKUP($B31,'SeuilsComparaison-EMT'!$C$5:$J$24,4,FALSE),IF(ISTEXT(I31)=TRUE,SUBSTITUTE(I31,\"<\",\"\",1)*1,I31)>VLOOKUP($B31,'SeuilsComparaison-EMT'!$C$5:$J$24,4,FALSE)=TRUE),(IF(ISTEXT(I31)=TRUE,SUBSTITUTE(I31,\"<\",\"\",1)*1,I31)-((IF(ISTEXT(I31)=TRUE,SUBSTITUTE(I31,\"<\",\"\",1)*1,I31)+IF(ISTEXT(K31)=TRUE,SUBSTITUTE(K31,\"<\",\"\",1)*1,K31))/2))/((IF(ISTEXT(I31)=TRUE,SUBSTITUTE(I31,\"<\",\"\",1)*1,I31)+IF(ISTEXT(K31)=TRUE,SUBSTITUTE(K31,\"<\",\"\",1),K31))/2),\"-\")))","v":""},{"$f":"IF(OR(K31=\"\",I31=\"\"),\"\",IF(AND(J31=\"Oui\",L31=\"Oui\"),\"Oui\",IF(M31=\"-\",\"Oui\",IF(OR(K31>VLOOKUP($B31,'SeuilsComparaison-EMT'!$C$5:$J$24,4,FALSE),I31>VLOOKUP($B31,'SeuilsComparaison-EMT'!$C$5:$J$24,4,FALSE)=TRUE),IF(I31<=VLOOKUP($B31,'SeuilsComparaison-EMT'!$C$5:$J$24,5,FALSE),IF(ABS(M31)<=VLOOKUP($B31,'SeuilsComparaison-EMT'!$C$5:$J$24,6,FALSE),\"Oui\",\"Non\"),IF(ABS(M31)<=VLOOKUP($B31,'SeuilsComparaison-EMT'!$C$5:$J$24,8,FALSE),\"Oui\",\"Non\")),\"Oui\"))))","v":""},null,null,null,null,{"$f":"IF(OR(Q31=\"\",O31=\"\"),\"\",IF(ISERROR(VLOOKUP($B31,'SeuilsComparaison-EMT'!$C$5:$J$24,4,FALSE)),\"-\",IF(OR(IF(ISTEXT(Q31)=TRUE,SUBSTITUTE(Q31,\"<\",\"\",1)*1,Q31)>VLOOKUP($B31,'SeuilsComparaison-EMT'!$C$5:$J$24,4,FALSE),IF(ISTEXT(O31)=TRUE,SUBSTITUTE(O31,\"<\",\"\",1)*1,O31)>VLOOKUP($B31,'SeuilsComparaison-EMT'!$C$5:$J$24,4,FALSE)=TRUE),(IF(ISTEXT(O31)=TRUE,SUBSTITUTE(O31,\"<\",\"\",1)*1,O31)-((IF(ISTEXT(O31)=TRUE,SUBSTITUTE(O31,\"<\",\"\",1)*1,O31)+IF(ISTEXT(Q31)=TRUE,SUBSTITUTE(Q31,\"<\",\"\",1)*1,Q31))/2))/((IF(ISTEXT(O31)=TRUE,SUBSTITUTE(O31,\"<\",\"\",1)*1,O31)+IF(ISTEXT(Q31)=TRUE,SUBSTITUTE(Q31,\"<\",\"\",1),Q31))/2),\"-\")))","v":""},{"$f":"IF(OR(Q31=\"\",O31=\"\"),\"\",IF(AND(P31=\"Oui\",R31=\"Oui\"),\"Oui\",IF(S31=\"-\",\"Oui\",IF(OR(Q31>VLOOKUP($B31,'SeuilsComparaison-EMT'!$C$5:$J$24,4,FALSE),O31>VLOOKUP($B31,'SeuilsComparaison-EMT'!$C$5:$J$24,4,FALSE)=TRUE),IF(O31<=VLOOKUP($B31,'SeuilsComparaison-EMT'!$C$5:$J$24,5,FALSE),IF(ABS(S31)<=VLOOKUP($B31,'SeuilsComparaison-EMT'!$C$5:$J$24,6,FALSE),\"Oui\",\"Non\"),IF(ABS(S31)<=VLOOKUP($B31,'SeuilsComparaison-EMT'!$C$5:$J$24,8,FALSE),\"Oui\",\"Non\")),\"Oui\"))))","v":""}]
[null,"COT",null,null,null,null,{"$f":"IF(OR(E32=\"\",C32=\"\"),\"\",IF(ISERROR(VLOOKUP($B32,'SeuilsComparaison-EMT'!$C$5:$J$24,4,FALSE)),\"-\",IF(OR(IF(ISTEXT(E32)=TRUE,SUBSTITUTE(E32,\"<\",\"\",1)*1,E32)>VLOOKUP($B32,'SeuilsComparaison-EMT'!$C$5:$J$24,4,FALSE),IF(ISTEXT(C32)=TRUE,SUBSTITUTE(C32,\"<\",\"\",1)*1,C32)>VLOOKUP($B32,'SeuilsComparaison-EMT'!$C$5:$J$24,4,FALSE)=TRUE),(IF(ISTEXT(C32)=TRUE,SUBSTITUTE(C32,\"<\",\"\",1)*1,C32)-((IF(ISTEXT(C32)=TRUE,SUBSTITUTE(C32,\"<\",\"\",1)*1,C32)+IF(ISTEXT(E32)=TRUE,SUBSTITUTE(E32,\"<\",\"\",1)*1,E32))/2))/((IF(ISTEXT(C32)=TRUE,SUBSTITUTE(C32,\"<\",\"\",1)*1,C32)+IF(ISTEXT(E32)=TRUE,SUBSTITUTE(E32,\"<\",\"\",1),E32))/2),\"-\")))","v":""},{"$f":"IF(OR(E32=\"\",C32=\"\"),\"\",IF(AND(D32=\"Oui\",F32=\"Oui\"),\"Oui\",IF(G32=\"-\",\"Oui\",IF(OR(E32>VLOOKUP($B32,'SeuilsComparaison-EMT'!$C$5:$J$24,4,FALSE),C32>VLOOKUP($B32,'SeuilsComparaison-EMT'!$C$5:$J$24,4,FALSE)=TRUE),IF(C32<=VLOOKUP($B32,'SeuilsComparaison-EMT'!$C$5:$J$24,5,FALSE),IF(ABS(G32)<=VLOOKUP($B32,'SeuilsComparaison-EMT'!$C$5:$J$24,6,FALSE),\"Oui\",\"Non\"),IF(ABS(G32)<=VLOOKUP($B32,'SeuilsComparaison-EMT'!$C$5:$J$24,8,FALSE),\"Oui\",\"Non\")),\"Oui\"))))","v":""},null,null,null,null,{"$f":"IF(OR(K32=\"\",I32=\"\"),\"\",IF(ISERROR(VLOOKUP($B32,'SeuilsComparaison-EMT'!$C$5:$J$24,4,FALSE)),\"-\",IF(OR(IF(ISTEXT(K32)=TRUE,SUBSTITUTE(K32,\"<\",\"\",1)*1,K32)>VLOOKUP($B32,'SeuilsComparaison-EMT'!$C$5:$J$24,4,FALSE),IF(ISTEXT(I32)=TRUE,SUBSTITUTE(I32,\"<\",\"\",1)*1,I32)>VLOOKUP($B32,'SeuilsComparaison-EMT'!$C$5:$J$24,4,FALSE)=TRUE),(IF(ISTEXT(I32)=TRUE,SUBSTITUTE(I32,\"<\",\"\",1)*1,I32)-((IF(ISTEXT(I32)=TRUE,SUBSTITUTE(I32,\"<\",\"\",1)*1,I32)+IF(ISTEXT(K32)=TRUE,SUBSTITUTE(K32,\"<\",\"\",1)*1,K32))/2))/((IF(ISTEXT(I32)=TRUE,SUBSTITUTE(I32,\"<\",\"\",1)*1,I32)+IF(ISTEXT(K32)=TRUE,SUBSTITUTE(K32,\"<\",\"\",1),K32))/2),\"-\")))","v":""},{"$f":"IF(OR(K32=\"\",I32=\"\"),\"\",IF(AND(J32=\"Oui\",L32=\"Oui\"),\"Oui\",IF(M32=\"-\",\"Oui\",IF(OR(K32>VLOOKUP($B32,'SeuilsComparaison-EMT'!$C$5:$J$24,4,FALSE),I32>VLOOKUP($B32,'SeuilsComparaison-EMT'!$C$5:$J$24,4,FALSE)=TRUE),IF(I32<=VLOOKUP($B32,'SeuilsComparaison-EMT'!$C$5:$J$24,5,FALSE),IF(ABS(M32)<=VLOOKUP($B32,'SeuilsComparaison-EMT'!$C$5:$J$24,6,FALSE),\"Oui\",\"Non\"),IF(ABS(M32)<=VLOOKUP($B32,'SeuilsComparaison-EMT'!$C$5:$J$24,8,FALSE),\"Oui\",\"Non\")),\"Oui\"))))","v":""},null,null,null,null,{"$f":"IF(OR(Q32=\"\",O32=\"\"),\"\",IF(ISERROR(VLOOKUP($B32,'SeuilsComparaison-EMT'!$C$5:$J$24,4,FALSE)),\"-\",IF(OR(IF(ISTEXT(Q32)=TRUE,SUBSTITUTE(Q32,\"<\",\"\",1)*1,Q32)>VLOOKUP($B32,'SeuilsComparaison-EMT'!$C$5:$J$24,4,FALSE),IF(ISTEXT(O32)=TRUE,SUBSTITUTE(O32,\"<\",\"\",1)*1,O32)>VLOOKUP($B32,'SeuilsComparaison-EMT'!$C$5:$J$24,4,FALSE)=TRUE),(IF(ISTEXT(O32)=TRUE,SUBSTITUTE(O32,\"<\",\"\",1)*1,O32)-((IF(ISTEXT(O32)=TRUE,SUBSTITUTE(O32,\"<\",\"\",1)*1,O32)+IF(ISTEXT(Q32)=TRUE,SUBSTITUTE(Q32,\"<\",\"\",1)*1,Q32))/2))/((IF(ISTEXT(O32)=TRUE,SUBSTITUTE(O32,\"<\",\"\",1)*1,O32)+IF(ISTEXT(Q32)=TRUE,SUBSTITUTE(Q32,\"<\",\"\",1),Q32))/2),\"-\")))","v":""},{"$f":"IF(OR(Q32=\"\",O32=\"\"),\"\",IF(AND(P32=\"Oui\",R32=\"Oui\"),\"Oui\",IF(S32=\"-\",\"Oui\",IF(OR(Q32>VLOOKUP($B32,'SeuilsComparaison-EMT'!$C$5:$J$24,4,FALSE),O32>VLOOKUP($B32,'SeuilsComparaison-EMT'!$C$5:$J$24,4,FALSE)=TRUE),IF(O32<=VLOOKUP($B32,'SeuilsComparaison-EMT'!$C$5:$J$24,5,FALSE),IF(ABS(S32)<=VLOOKUP($B32,'SeuilsComparaison-EMT'!$C$5:$J$24,6,FALSE),\"Oui\",\"Non\"),IF(ABS(S32)<=VLOOKUP($B32,'SeuilsComparaison-EMT'!$C$5:$J$24,8,FALSE),\"Oui\",\"Non\")),\"Oui\"))))","v":""}]
[null,"MEST",null,null,null,null,{"$f":"IF(OR(E33=\"\",C33=\"\"),\"\",IF(ISERROR(VLOOKUP($B33,'SeuilsComparaison-EMT'!$C$5:$J$24,4,FALSE)),\"-\",IF(OR(IF(ISTEXT(E33)=TRUE,SUBSTITUTE(E33,\"<\",\"\",1)*1,E33)>VLOOKUP($B33,'SeuilsComparaison-EMT'!$C$5:$J$24,4,FALSE),IF(ISTEXT(C33)=TRUE,SUBSTITUTE(C33,\"<\",\"\",1)*1,C33)>VLOOKUP($B33,'SeuilsComparaison-EMT'!$C$5:$J$24,4,FALSE)=TRUE),(IF(ISTEXT(C33)=TRUE,SUBSTITUTE(C33,\"<\",\"\",1)*1,C33)-((IF(ISTEXT(C33)=TRUE,SUBSTITUTE(C33,\"<\",\"\",1)*1,C33)+IF(ISTEXT(E33)=TRUE,SUBSTITUTE(E33,\"<\",\"\",1)*1,E33))/2))/((IF(ISTEXT(C33)=TRUE,SUBSTITUTE(C33,\"<\",\"\",1)*1,C33)+IF(ISTEXT(E33)=TRUE,SUBSTITUTE(E33,\"<\",\"\",1),E33))/2),\"-\")))","v":""},{"$f":"IF(OR(E33=\"\",C33=\"\"),\"\",IF(AND(D33=\"Oui\",F33=\"Oui\"),\"Oui\",IF(G33=\"-\",\"Oui\",IF(OR(E33>VLOOKUP($B33,'SeuilsComparaison-EMT'!$C$5:$J$24,4,FALSE),C33>VLOOKUP($B33,'SeuilsComparaison-EMT'!$C$5:$J$24,4,FALSE)=TRUE),IF(C33<=VLOOKUP($B33,'SeuilsComparaison-EMT'!$C$5:$J$24,5,FALSE),IF(ABS(G33)<=VLOOKUP($B33,'SeuilsComparaison-EMT'!$C$5:$J$24,6,FALSE),\"Oui\",\"Non\"),IF(ABS(G33)<=VLOOKUP($B33,'SeuilsComparaison-EMT'!$C$5:$J$24,8,FALSE),\"Oui\",\"Non\")),\"Oui\"))))","v":""},null,null,null,null,{"$f":"IF(OR(K33=\"\",I33=\"\"),\"\",IF(ISERROR(VLOOKUP($B33,'SeuilsComparaison-EMT'!$C$5:$J$24,4,FALSE)),\"-\",IF(OR(IF(ISTEXT(K33)=TRUE,SUBSTITUTE(K33,\"<\",\"\",1)*1,K33)>VLOOKUP($B33,'SeuilsComparaison-EMT'!$C$5:$J$24,4,FALSE),IF(ISTEXT(I33)=TRUE,SUBSTITUTE(I33,\"<\",\"\",1)*1,I33)>VLOOKUP($B33,'SeuilsComparaison-EMT'!$C$5:$J$24,4,FALSE)=TRUE),(IF(ISTEXT(I33)=TRUE,SUBSTITUTE(I33,\"<\",\"\",1)*1,I33)-((IF(ISTEXT(I33)=TRUE,SUBSTITUTE(I33,\"<\",\"\",1)*1,I33)+IF(ISTEXT(K33)=TRUE,SUBSTITUTE(K33,\"<\",\"\",1)*1,K33))/2))/((IF(ISTEXT(I33)=TRUE,SUBSTITUTE(I33,\"<\",\"\",1)*1,I33)+IF(ISTEXT(K33)=TRUE,SUBSTITUTE(K33,\"<\",\"\",1),K33))/2),\"-\")))","v":""},{"$f":"IF(OR(K33=\"\",I33=\"\"),\"\",IF(AND(J33=\"Oui\",L33=\"Oui\"),\"Oui\",IF(M33=\"-\",\"Oui\",IF(OR(K33>VLOOKUP($B33,'SeuilsComparaison-EMT'!$C$5:$J$24,4,FALSE),I33>VLOOKUP($B33,'SeuilsComparaison-EMT'!$C$5:$J$24,4,FALSE)=TRUE),IF(I33<=VLOOKUP($B33,'SeuilsComparaison-EMT'!$C$5:$J$24,5,FALSE),IF(ABS(M33)<=VLOOKUP($B33,'SeuilsComparaison-EMT'!$C$5:$J$24,6,FALSE),\"Oui\",\"Non\"),IF(ABS(M33)<=VLOOKUP($B33,'SeuilsComparaison-EMT'!$C$5:$J$24,8,FALSE),\"Oui\",\"Non\")),\"Oui\"))))","v":""},null,null,null,null,{"$f":"IF(OR(Q33=\"\",O33=\"\"),\"\",IF(ISERROR(VLOOKUP($B33,'SeuilsComparaison-EMT'!$C$5:$J$24,4,FALSE)),\"-\",IF(OR(IF(ISTEXT(Q33)=TRUE,SUBSTITUTE(Q33,\"<\",\"\",1)*1,Q33)>VLOOKUP($B33,'SeuilsComparaison-EMT'!$C$5:$J$24,4,FALSE),IF(ISTEXT(O33)=TRUE,SUBSTITUTE(O33,\"<\",\"\",1)*1,O33)>VLOOKUP($B33,'SeuilsComparaison-EMT'!$C$5:$J$24,4,FALSE)=TRUE),(IF(ISTEXT(O33)=TRUE,SUBSTITUTE(O33,\"<\",\"\",1)*1,O33)-((IF(ISTEXT(O33)=TRUE,SUBSTITUTE(O33,\"<\",\"\",1)*1,O33)+IF(ISTEXT(Q33)=TRUE,SUBSTITUTE(Q33,\"<\",\"\",1)*1,Q33))/2))/((IF(ISTEXT(O33)=TRUE,SUBSTITUTE(O33,\"<\",\"\",1)*1,O33)+IF(ISTEXT(Q33)=TRUE,SUBSTITUTE(Q33,\"<\",\"\",1),Q33))/2),\"-\")))","v":""},{"$f":"IF(OR(Q33=\"\",O33=\"\"),\"\",IF(AND(P33=\"Oui\",R33=\"Oui\"),\"Oui\",IF(S33=\"-\",\"Oui\",IF(OR(Q33>VLOOKUP($B33,'SeuilsComparaison-EMT'!$C$5:$J$24,4,FALSE),O33>VLOOKUP($B33,'SeuilsComparaison-EMT'!$C$5:$J$24,4,FALSE)=TRUE),IF(O33<=VLOOKUP($B33,'SeuilsComparaison-EMT'!$C$5:$J$24,5,FALSE),IF(ABS(S33)<=VLOOKUP($B33,'SeuilsComparaison-EMT'!$C$5:$J$24,6,FALSE),\"Oui\",\"Non\"),IF(ABS(S33)<=VLOOKUP($B33,'SeuilsComparaison-EMT'!$C$5:$J$24,8,FALSE),\"Oui\",\"Non\")),\"Oui\"))))","v":""}]
[null,"NKJ (N)",null,null,null,null,{"$f":"IF(OR(E34=\"\",C34=\"\"),\"\",IF(ISERROR(VLOOKUP($B34,'SeuilsComparaison-EMT'!$C$5:$J$24,4,FALSE)),\"-\",IF(OR(IF(ISTEXT(E34)=TRUE,SUBSTITUTE(E34,\"<\",\"\",1)*1,E34)>VLOOKUP($B34,'SeuilsComparaison-EMT'!$C$5:$J$24,4,FALSE),IF(ISTEXT(C34)=TRUE,SUBSTITUTE(C34,\"<\",\"\",1)*1,C34)>VLOOKUP($B34,'SeuilsComparaison-EMT'!$C$5:$J$24,4,FALSE)=TRUE),(IF(ISTEXT(C34)=TRUE,SUBSTITUTE(C34,\"<\",\"\",1)*1,C34)-((IF(ISTEXT(C34)=TRUE,SUBSTITUTE(C34,\"<\",\"\",1)*1,C34)+IF(ISTEXT(E34)=TRUE,SUBSTITUTE(E34,\"<\",\"\",1)*1,E34))/2))/((IF(ISTEXT(C34)=TRUE,SUBSTITUTE(C34,\"<\",\"\",1)*1,C34)+IF(ISTEXT(E34)=TRUE,SUBSTITUTE(E34,\"<\",\"\",1),E34))/2),\"-\")))","v":""},{"$f":"IF(OR(E34=\"\",C34=\"\"),\"\",IF(AND(D34=\"Oui\",F34=\"Oui\"),\"Oui\",IF(G34=\"-\",\"Oui\",IF(OR(E34>VLOOKUP($B34,'SeuilsComparaison-EMT'!$C$5:$J$24,4,FALSE),C34>VLOOKUP($B34,'SeuilsComparaison-EMT'!$C$5:$J$24,4,FALSE)=TRUE),IF(C34<=VLOOKUP($B34,'SeuilsComparaison-EMT'!$C$5:$J$24,5,FALSE),IF(ABS(G34)<=VLOOKUP($B34,'SeuilsComparaison-EMT'!$C$5:$J$24,6,FALSE),\"Oui\",\"Non\"),IF(ABS(G34)<=VLOOKUP($B34,'SeuilsComparaison-EMT'!$C$5:$J$24,8,FALSE),\"Oui\",\"Non\")),\"Oui\"))))","v":""},null,null,null,null,{"$f":"IF(OR(K34=\"\",I34=\"\"),\"\",IF(ISERROR(VLOOKUP($B34,'SeuilsComparaison-EMT'!$C$5:$J$24,4,FALSE)),\"-\",IF(OR(IF(ISTEXT(K34)=TRUE,SUBSTITUTE(K34,\"<\",\"\",1)*1,K34)>VLOOKUP($B34,'SeuilsComparaison-EMT'!$C$5:$J$24,4,FALSE),IF(ISTEXT(I34)=TRUE,SUBSTITUTE(I34,\"<\",\"\",1)*1,I34)>VLOOKUP($B34,'SeuilsComparaison-EMT'!$C$5:$J$24,4,FALSE)=TRUE),(IF(ISTEXT(I34)=TRUE,SUBSTITUTE(I34,\"<\",\"\",1)*1,I34)-((IF(ISTEXT(I34)=TRUE,SUBSTITUTE(I34,\"<\",\"\",1)*1,I34)+IF(ISTEXT(K34)=TRUE,SUBSTITUTE(K34,\"<\",\"\",1)*1,K34))/2))/((IF(ISTEXT(I34)=TRUE,SUBSTITUTE(I34,\"<\",\"\",1)*1,I34)+IF(ISTEXT(K34)=TRUE,SUBSTITUTE(K34,\"<\",\"\",1),K34))/2),\"-\")))","v":""},{"$f":"IF(OR(K34=\"\",I34=\"\"),\"\",IF(AND(J34=\"Oui\",L34=\"Oui\"),\"Oui\",IF(M34=\"-\",\"Oui\",IF(OR(K34>VLOOKUP($B34,'SeuilsComparaison-EMT'!$C$5:$J$24,4,FALSE),I34>VLOOKUP($B34,'SeuilsComparaison-EMT'!$C$5:$J$24,4,FALSE)=TRUE),IF(I34<=VLOOKUP($B34,'SeuilsComparaison-EMT'!$C$5:$J$24,5,FALSE),IF(ABS(M34)<=VLOOKUP($B34,'SeuilsComparaison-EMT'!$C$5:$J$24,6,FALSE),\"Oui\",\"Non\"),IF(ABS(M34)<=VLOOKUP($B34,'SeuilsComparaison-EMT'!$C$5:$J$24,8,FALSE),\"Oui\",\"Non\")),\"Oui\"))))","v":""},null,null,null,null,{"$f":"IF(OR(Q34=\"\",O34=\"\"),\"\",IF(ISERROR(VLOOKUP($B34,'SeuilsComparaison-EMT'!$C$5:$J$24,4,FALSE)),\"-\",IF(OR(IF(ISTEXT(Q34)=TRUE,SUBSTITUTE(Q34,\"<\",\"\",1)*1,Q34)>VLOOKUP($B34,'SeuilsComparaison-EMT'!$C$5:$J$24,4,FALSE),IF(ISTEXT(O34)=TRUE,SUBSTITUTE(O34,\"<\",\"\",1)*1,O34)>VLOOKUP($B34,'SeuilsComparaison-EMT'!$C$5:$J$24,4,FALSE)=TRUE),(IF(ISTEXT(O34)=TRUE,SUBSTITUTE(O34,\"<\",\"\",1)*1,O34)-((IF(ISTEXT(O34)=TRUE,SUBSTITUTE(O34,\"<\",\"\",1)*1,O34)+IF(ISTEXT(Q34)=TRUE,SUBSTITUTE(Q34,\"<\",\"\",1)*1,Q34))/2))/((IF(ISTEXT(O34)=TRUE,SUBSTITUTE(O34,\"<\",\"\",1)*1,O34)+IF(ISTEXT(Q34)=TRUE,SUBSTITUTE(Q34,\"<\",\"\",1),Q34))/2),\"-\")))","v":""},{"$f":"IF(OR(Q34=\"\",O34=\"\"),\"\",IF(AND(P34=\"Oui\",R34=\"Oui\"),\"Oui\",IF(S34=\"-\",\"Oui\",IF(OR(Q34>VLOOKUP($B34,'SeuilsComparaison-EMT'!$C$5:$J$24,4,FALSE),O34>VLOOKUP($B34,'SeuilsComparaison-EMT'!$C$5:$J$24,4,FALSE)=TRUE),IF(O34<=VLOOKUP($B34,'SeuilsComparaison-EMT'!$C$5:$J$24,5,FALSE),IF(ABS(S34)<=VLOOKUP($B34,'SeuilsComparaison-EMT'!$C$5:$J$24,6,FALSE),\"Oui\",\"Non\"),IF(ABS(S34)<=VLOOKUP($B34,'SeuilsComparaison-EMT'!$C$5:$J$24,8,FALSE),\"Oui\",\"Non\")),\"Oui\"))))","v":""}]
[null,"NH4 (NH4)",null,null,null,null,{"$f":"IF(OR(E35=\"\",C35=\"\"),\"\",IF(ISERROR(VLOOKUP($B35,'SeuilsComparaison-EMT'!$C$5:$J$24,4,FALSE)),\"-\",IF(OR(IF(ISTEXT(E35)=TRUE,SUBSTITUTE(E35,\"<\",\"\",1)*1,E35)>VLOOKUP($B35,'SeuilsComparaison-EMT'!$C$5:$J$24,4,FALSE),IF(ISTEXT(C35)=TRUE,SUBSTITUTE(C35,\"<\",\"\",1)*1,C35)>VLOOKUP($B35,'SeuilsComparaison-EMT'!$C$5:$J$24,4,FALSE)=TRUE),(IF(ISTEXT(C35)=TRUE,SUBSTITUTE(C35,\"<\",\"\",1)*1,C35)-((IF(ISTEXT(C35)=TRUE,SUBSTITUTE(C35,\"<\",\"\",1)*1,C35)+IF(ISTEXT(E35)=TRUE,SUBSTITUTE(E35,\"<\",\"\",1)*1,E35))/2))/((IF(ISTEXT(C35)=TRUE,SUBSTITUTE(C35,\"<\",\"\",1)*1,C35)+IF(ISTEXT(E35)=TRUE,SUBSTITUTE(E35,\"<\",\"\",1),E35))/2),\"-\")))","v":""},{"$f":"IF(OR(E35=\"\",C35=\"\"),\"\",IF(AND(D35=\"Oui\",F35=\"Oui\"),\"Oui\",IF(G35=\"-\",\"Oui\",IF(OR(E35>VLOOKUP($B35,'SeuilsComparaison-EMT'!$C$5:$J$24,4,FALSE),C35>VLOOKUP($B35,'SeuilsComparaison-EMT'!$C$5:$J$24,4,FALSE)=TRUE),IF(C35<=VLOOKUP($B35,'SeuilsComparaison-EMT'!$C$5:$J$24,5,FALSE),IF(ABS(G35)<=VLOOKUP($B35,'SeuilsComparaison-EMT'!$C$5:$J$24,6,FALSE),\"Oui\",\"Non\"),IF(ABS(G35)<=VLOOKUP($B35,'SeuilsComparaison-EMT'!$C$5:$J$24,8,FALSE),\"Oui\",\"Non\")),\"Oui\"))))","v":""},null,null,null,null,{"$f":"IF(OR(K35=\"\",I35=\"\"),\"\",IF(ISERROR(VLOOKUP($B35,'SeuilsComparaison-EMT'!$C$5:$J$24,4,FALSE)),\"-\",IF(OR(IF(ISTEXT(K35)=TRUE,SUBSTITUTE(K35,\"<\",\"\",1)*1,K35)>VLOOKUP($B35,'SeuilsComparaison-EMT'!$C$5:$J$24,4,FALSE),IF(ISTEXT(I35)=TRUE,SUBSTITUTE(I35,\"<\",\"\",1)*1,I35)>VLOOKUP($B35,'SeuilsComparaison-EMT'!$C$5:$J$24,4,FALSE)=TRUE),(IF(ISTEXT(I35)=TRUE,SUBSTITUTE(I35,\"<\",\"\",1)*1,I35)-((IF(ISTEXT(I35)=TRUE,SUBSTITUTE(I35,\"<\",\"\",1)*1,I35)+IF(ISTEXT(K35)=TRUE,SUBSTITUTE(K35,\"<\",\"\",1)*1,K35))/2))/((IF(ISTEXT(I35)=TRUE,SUBSTITUTE(I35,\"<\",\"\",1)*1,I35)+IF(ISTEXT(K35)=TRUE,SUBSTITUTE(K35,\"<\",\"\",1),K35))/2),\"-\")))","v":""},{"$f":"IF(OR(K35=\"\",I35=\"\"),\"\",IF(AND(J35=\"Oui\",L35=\"Oui\"),\"Oui\",IF(M35=\"-\",\"Oui\",IF(OR(K35>VLOOKUP($B35,'SeuilsComparaison-EMT'!$C$5:$J$24,4,FALSE),I35>VLOOKUP($B35,'SeuilsComparaison-EMT'!$C$5:$J$24,4,FALSE)=TRUE),IF(I35<=VLOOKUP($B35,'SeuilsComparaison-EMT'!$C$5:$J$24,5,FALSE),IF(ABS(M35)<=VLOOKUP($B35,'SeuilsComparaison-EMT'!$C$5:$J$24,6,FALSE),\"Oui\",\"Non\"),IF(ABS(M35)<=VLOOKUP($B35,'SeuilsComparaison-EMT'!$C$5:$J$24,8,FALSE),\"Oui\",\"Non\")),\"Oui\"))))","v":""},null,null,null,null,{"$f":"IF(OR(Q35=\"\",O35=\"\"),\"\",IF(ISERROR(VLOOKUP($B35,'SeuilsComparaison-EMT'!$C$5:$J$24,4,FALSE)),\"-\",IF(OR(IF(ISTEXT(Q35)=TRUE,SUBSTITUTE(Q35,\"<\",\"\",1)*1,Q35)>VLOOKUP($B35,'SeuilsComparaison-EMT'!$C$5:$J$24,4,FALSE),IF(ISTEXT(O35)=TRUE,SUBSTITUTE(O35,\"<\",\"\",1)*1,O35)>VLOOKUP($B35,'SeuilsComparaison-EMT'!$C$5:$J$24,4,FALSE)=TRUE),(IF(ISTEXT(O35)=TRUE,SUBSTITUTE(O35,\"<\",\"\",1)*1,O35)-((IF(ISTEXT(O35)=TRUE,SUBSTITUTE(O35,\"<\",\"\",1)*1,O35)+IF(ISTEXT(Q35)=TRUE,SUBSTITUTE(Q35,\"<\",\"\",1)*1,Q35))/2))/((IF(ISTEXT(O35)=TRUE,SUBSTITUTE(O35,\"<\",\"\",1)*1,O35)+IF(ISTEXT(Q35)=TRUE,SUBSTITUTE(Q35,\"<\",\"\",1),Q35))/2),\"-\")))","v":""},{"$f":"IF(OR(Q35=\"\",O35=\"\"),\"\",IF(AND(P35=\"Oui\",R35=\"Oui\"),\"Oui\",IF(S35=\"-\",\"Oui\",IF(OR(Q35>VLOOKUP($B35,'SeuilsComparaison-EMT'!$C$5:$J$24,4,FALSE),O35>VLOOKUP($B35,'SeuilsComparaison-EMT'!$C$5:$J$24,4,FALSE)=TRUE),IF(O35<=VLOOKUP($B35,'SeuilsComparaison-EMT'!$C$5:$J$24,5,FALSE),IF(ABS(S35)<=VLOOKUP($B35,'SeuilsComparaison-EMT'!$C$5:$J$24,6,FALSE),\"Oui\",\"Non\"),IF(ABS(S35)<=VLOOKUP($B35,'SeuilsComparaison-EMT'!$C$5:$J$24,8,FALSE),\"Oui\",\"Non\")),\"Oui\"))))","v":""}]
[null,"NO2 (NO2)",null,null,null,null,{"$f":"IF(OR(E36=\"\",C36=\"\"),\"\",IF(ISERROR(VLOOKUP($B36,'SeuilsComparaison-EMT'!$C$5:$J$24,4,FALSE)),\"-\",IF(OR(IF(ISTEXT(E36)=TRUE,SUBSTITUTE(E36,\"<\",\"\",1)*1,E36)>VLOOKUP($B36,'SeuilsComparaison-EMT'!$C$5:$J$24,4,FALSE),IF(ISTEXT(C36)=TRUE,SUBSTITUTE(C36,\"<\",\"\",1)*1,C36)>VLOOKUP($B36,'SeuilsComparaison-EMT'!$C$5:$J$24,4,FALSE)=TRUE),(IF(ISTEXT(C36)=TRUE,SUBSTITUTE(C36,\"<\",\"\",1)*1,C36)-((IF(ISTEXT(C36)=TRUE,SUBSTITUTE(C36,\"<\",\"\",1)*1,C36)+IF(ISTEXT(E36)=TRUE,SUBSTITUTE(E36,\"<\",\"\",1)*1,E36))/2))/((IF(ISTEXT(C36)=TRUE,SUBSTITUTE(C36,\"<\",\"\",1)*1,C36)+IF(ISTEXT(E36)=TRUE,SUBSTITUTE(E36,\"<\",\"\",1),E36))/2),\"-\")))","v":""},{"$f":"IF(OR(E36=\"\",C36=\"\"),\"\",IF(AND(D36=\"Oui\",F36=\"Oui\"),\"Oui\",IF(G36=\"-\",\"Oui\",IF(OR(E36>VLOOKUP($B36,'SeuilsComparaison-EMT'!$C$5:$J$24,4,FALSE),C36>VLOOKUP($B36,'SeuilsComparaison-EMT'!$C$5:$J$24,4,FALSE)=TRUE),IF(C36<=VLOOKUP($B36,'SeuilsComparaison-EMT'!$C$5:$J$24,5,FALSE),IF(ABS(G36)<=VLOOKUP($B36,'SeuilsComparaison-EMT'!$C$5:$J$24,6,FALSE),\"Oui\",\"Non\"),IF(ABS(G36)<=VLOOKUP($B36,'SeuilsComparaison-EMT'!$C$5:$J$24,8,FALSE),\"Oui\",\"Non\")),\"Oui\"))))","v":""},null,null,null,null,{"$f":"IF(OR(K36=\"\",I36=\"\"),\"\",IF(ISERROR(VLOOKUP($B36,'SeuilsComparaison-EMT'!$C$5:$J$24,4,FALSE)),\"-\",IF(OR(IF(ISTEXT(K36)=TRUE,SUBSTITUTE(K36,\"<\",\"\",1)*1,K36)>VLOOKUP($B36,'SeuilsComparaison-EMT'!$C$5:$J$24,4,FALSE),IF(ISTEXT(I36)=TRUE,SUBSTITUTE(I36,\"<\",\"\",1)*1,I36)>VLOOKUP($B36,'SeuilsComparaison-EMT'!$C$5:$J$24,4,FALSE)=TRUE),(IF(ISTEXT(I36)=TRUE,SUBSTITUTE(I36,\"<\",\"\",1)*1,I36)-((IF(ISTEXT(I36)=TRUE,SUBSTITUTE(I36,\"<\",\"\",1)*1,I36)+IF(ISTEXT(K36)=TRUE,SUBSTITUTE(K36,\"<\",\"\",1)*1,K36))/2))/((IF(ISTEXT(I36)=TRUE,SUBSTITUTE(I36,\"<\",\"\",1)*1,I36)+IF(ISTEXT(K36)=TRUE,SUBSTITUTE(K36,\"<\",\"\",1),K36))/2),\"-\")))","v":""},{"$f":"IF(OR(K36=\"\",I36=\"\"),\"\",IF(AND(J36=\"Oui\",L36=\"Oui\"),\"Oui\",IF(M36=\"-\",\"Oui\",IF(OR(K36>VLOOKUP($B36,'SeuilsComparaison-EMT'!$C$5:$J$24,4,FALSE),I36>VLOOKUP($B36,'SeuilsComparaison-EMT'!$C$5:$J$24,4,FALSE)=TRUE),IF(I36<=VLOOKUP($B36,'SeuilsComparaison-EMT'!$C$5:$J$24,5,FALSE),IF(ABS(M36)<=VLOOKUP($B36,'SeuilsComparaison-EMT'!$C$5:$J$24,6,FALSE),\"Oui\",\"Non\"),IF(ABS(M36)<=VLOOKUP($B36,'SeuilsComparaison-EMT'!$C$5:$J$24,8,FALSE),\"Oui\",\"Non\")),\"Oui\"))))","v":""},null,null,null,null,{"$f":"IF(OR(Q36=\"\",O36=\"\"),\"\",IF(ISERROR(VLOOKUP($B36,'SeuilsComparaison-EMT'!$C$5:$J$24,4,FALSE)),\"-\",IF(OR(IF(ISTEXT(Q36)=TRUE,SUBSTITUTE(Q36,\"<\",\"\",1)*1,Q36)>VLOOKUP($B36,'SeuilsComparaison-EMT'!$C$5:$J$24,4,FALSE),IF(ISTEXT(O36)=TRUE,SUBSTITUTE(O36,\"<\",\"\",1)*1,O36)>VLOOKUP($B36,'SeuilsComparaison-EMT'!$C$5:$J$24,4,FALSE)=TRUE),(IF(ISTEXT(O36)=TRUE,SUBSTITUTE(O36,\"<\",\"\",1)*1,O36)-((IF(ISTEXT(O36)=TRUE,SUBSTITUTE(O36,\"<\",\"\",1)*1,O36)+IF(ISTEXT(Q36)=TRUE,SUBSTITUTE(Q36,\"<\",\"\",1)*1,Q36))/2))/((IF(ISTEXT(O36)=TRUE,SUBSTITUTE(O36,\"<\",\"\",1)*1,O36)+IF(ISTEXT(Q36)=TRUE,SUBSTITUTE(Q36,\"<\",\"\",1),Q36))/2),\"-\")))","v":""},{"$f":"IF(OR(Q36=\"\",O36=\"\"),\"\",IF(AND(P36=\"Oui\",R36=\"Oui\"),\"Oui\",IF(S36=\"-\",\"Oui\",IF(OR(Q36>VLOOKUP($B36,'SeuilsComparaison-EMT'!$C$5:$J$24,4,FALSE),O36>VLOOKUP($B36,'SeuilsComparaison-EMT'!$C$5:$J$24,4,FALSE)=TRUE),IF(O36<=VLOOKUP($B36,'SeuilsComparaison-EMT'!$C$5:$J$24,5,FALSE),IF(ABS(S36)<=VLOOKUP($B36,'SeuilsComparaison-EMT'!$C$5:$J$24,6,FALSE),\"Oui\",\"Non\"),IF(ABS(S36)<=VLOOKUP($B36,'SeuilsComparaison-EMT'!$C$5:$J$24,8,FALSE),\"Oui\",\"Non\")),\"Oui\"))))","v":""}]
[null,"NO3 (NO3)",null,null,null,null,{"$f":"IF(OR(E37=\"\",C37=\"\"),\"\",IF(ISERROR(VLOOKUP($B37,'SeuilsComparaison-EMT'!$C$5:$J$24,4,FALSE)),\"-\",IF(OR(IF(ISTEXT(E37)=TRUE,SUBSTITUTE(E37,\"<\",\"\",1)*1,E37)>VLOOKUP($B37,'SeuilsComparaison-EMT'!$C$5:$J$24,4,FALSE),IF(ISTEXT(C37)=TRUE,SUBSTITUTE(C37,\"<\",\"\",1)*1,C37)>VLOOKUP($B37,'SeuilsComparaison-EMT'!$C$5:$J$24,4,FALSE)=TRUE),(IF(ISTEXT(C37)=TRUE,SUBSTITUTE(C37,\"<\",\"\",1)*1,C37)-((IF(ISTEXT(C37)=TRUE,SUBSTITUTE(C37,\"<\",\"\",1)*1,C37)+IF(ISTEXT(E37)=TRUE,SUBSTITUTE(E37,\"<\",\"\",1)*1,E37))/2))/((IF(ISTEXT(C37)=TRUE,SUBSTITUTE(C37,\"<\",\"\",1)*1,C37)+IF(ISTEXT(E37)=TRUE,SUBSTITUTE(E37,\"<\",\"\",1),E37))/2),\"-\")))","v":""},{"$f":"IF(OR(E37=\"\",C37=\"\"),\"\",IF(AND(D37=\"Oui\",F37=\"Oui\"),\"Oui\",IF(G37=\"-\",\"Oui\",IF(OR(E37>VLOOKUP($B37,'SeuilsComparaison-EMT'!$C$5:$J$24,4,FALSE),C37>VLOOKUP($B37,'SeuilsComparaison-EMT'!$C$5:$J$24,4,FALSE)=TRUE),IF(C37<=VLOOKUP($B37,'SeuilsComparaison-EMT'!$C$5:$J$24,5,FALSE),IF(ABS(G37)<=VLOOKUP($B37,'SeuilsComparaison-EMT'!$C$5:$J$24,6,FALSE),\"Oui\",\"Non\"),IF(ABS(G37)<=VLOOKUP($B37,'SeuilsComparaison-EMT'!$C$5:$J$24,8,FALSE),\"Oui\",\"Non\")),\"Oui\"))))","v":""},null,null,null,null,{"$f":"IF(OR(K37=\"\",I37=\"\"),\"\",IF(ISERROR(VLOOKUP($B37,'SeuilsComparaison-EMT'!$C$5:$J$24,4,FALSE)),\"-\",IF(OR(IF(ISTEXT(K37)=TRUE,SUBSTITUTE(K37,\"<\",\"\",1)*1,K37)>VLOOKUP($B37,'SeuilsComparaison-EMT'!$C$5:$J$24,4,FALSE),IF(ISTEXT(I37)=TRUE,SUBSTITUTE(I37,\"<\",\"\",1)*1,I37)>VLOOKUP($B37,'SeuilsComparaison-EMT'!$C$5:$J$24,4,FALSE)=TRUE),(IF(ISTEXT(I37)=TRUE,SUBSTITUTE(I37,\"<\",\"\",1)*1,I37)-((IF(ISTEXT(I37)=TRUE,SUBSTITUTE(I37,\"<\",\"\",1)*1,I37)+IF(ISTEXT(K37)=TRUE,SUBSTITUTE(K37,\"<\",\"\",1)*1,K37))/2))/((IF(ISTEXT(I37)=TRUE,SUBSTITUTE(I37,\"<\",\"\",1)*1,I37)+IF(ISTEXT(K37)=TRUE,SUBSTITUTE(K37,\"<\",\"\",1),K37))/2),\"-\")))","v":""},{"$f":"IF(OR(K37=\"\",I37=\"\"),\"\",IF(AND(J37=\"Oui\",L37=\"Oui\"),\"Oui\",IF(M37=\"-\",\"Oui\",IF(OR(K37>VLOOKUP($B37,'SeuilsComparaison-EMT'!$C$5:$J$24,4,FALSE),I37>VLOOKUP($B37,'SeuilsComparaison-EMT'!$C$5:$J$24,4,FALSE)=TRUE),IF(I37<=VLOOKUP($B37,'SeuilsComparaison-EMT'!$C$5:$J$24,5,FALSE),IF(ABS(M37)<=VLOOKUP($B37,'SeuilsComparaison-EMT'!$C$5:$J$24,6,FALSE),\"Oui\",\"Non\"),IF(ABS(M37)<=VLOOKUP($B37,'SeuilsComparaison-EMT'!$C$5:$J$24,8,FALSE),\"Oui\",\"Non\")),\"Oui\"))))","v":""},null,null,null,null,{"$f":"IF(OR(Q37=\"\",O37=\"\"),\"\",IF(ISERROR(VLOOKUP($B37,'SeuilsComparaison-EMT'!$C$5:$J$24,4,FALSE)),\"-\",IF(OR(IF(ISTEXT(Q37)=TRUE,SUBSTITUTE(Q37,\"<\",\"\",1)*1,Q37)>VLOOKUP($B37,'SeuilsComparaison-EMT'!$C$5:$J$24,4,FALSE),IF(ISTEXT(O37)=TRUE,SUBSTITUTE(O37,\"<\",\"\",1)*1,O37)>VLOOKUP($B37,'SeuilsComparaison-EMT'!$C$5:$J$24,4,FALSE)=TRUE),(IF(ISTEXT(O37)=TRUE,SUBSTITUTE(O37,\"<\",\"\",1)*1,O37)-((IF(ISTEXT(O37)=TRUE,SUBSTITUTE(O37,\"<\",\"\",1)*1,O37)+IF(ISTEXT(Q37)=TRUE,SUBSTITUTE(Q37,\"<\",\"\",1)*1,Q37))/2))/((IF(ISTEXT(O37)=TRUE,SUBSTITUTE(O37,\"<\",\"\",1)*1,O37)+IF(ISTEXT(Q37)=TRUE,SUBSTITUTE(Q37,\"<\",\"\",1),Q37))/2),\"-\")))","v":""},{"$f":"IF(OR(Q37=\"\",O37=\"\"),\"\",IF(AND(P37=\"Oui\",R37=\"Oui\"),\"Oui\",IF(S37=\"-\",\"Oui\",IF(OR(Q37>VLOOKUP($B37,'SeuilsComparaison-EMT'!$C$5:$J$24,4,FALSE),O37>VLOOKUP($B37,'SeuilsComparaison-EMT'!$C$5:$J$24,4,FALSE)=TRUE),IF(O37<=VLOOKUP($B37,'SeuilsComparaison-EMT'!$C$5:$J$24,5,FALSE),IF(ABS(S37)<=VLOOKUP($B37,'SeuilsComparaison-EMT'!$C$5:$J$24,6,FALSE),\"Oui\",\"Non\"),IF(ABS(S37)<=VLOOKUP($B37,'SeuilsComparaison-EMT'!$C$5:$J$24,8,FALSE),\"Oui\",\"Non\")),\"Oui\"))))","v":""}]
[null,"NGL",null,null,null,null,{"$f":"IF(OR(E38=\"\",C38=\"\"),\"\",IF(ISERROR(VLOOKUP($B38,'SeuilsComparaison-EMT'!$C$5:$J$24,4,FALSE)),\"-\",IF(OR(IF(ISTEXT(E38)=TRUE,SUBSTITUTE(E38,\"<\",\"\",1)*1,E38)>VLOOKUP($B38,'SeuilsComparaison-EMT'!$C$5:$J$24,4,FALSE),IF(ISTEXT(C38)=TRUE,SUBSTITUTE(C38,\"<\",\"\",1)*1,C38)>VLOOKUP($B38,'SeuilsComparaison-EMT'!$C$5:$J$24,4,FALSE)=TRUE),(IF(ISTEXT(C38)=TRUE,SUBSTITUTE(C38,\"<\",\"\",1)*1,C38)-((IF(ISTEXT(C38)=TRUE,SUBSTITUTE(C38,\"<\",\"\",1)*1,C38)+IF(ISTEXT(E38)=TRUE,SUBSTITUTE(E38,\"<\",\"\",1)*1,E38))/2))/((IF(ISTEXT(C38)=TRUE,SUBSTITUTE(C38,\"<\",\"\",1)*1,C38)+IF(ISTEXT(E38)=TRUE,SUBSTITUTE(E38,\"<\",\"\",1),E38))/2),\"-\")))","v":""},{"$f":"IF(OR(E38=\"\",C38=\"\"),\"\",IF(AND(D38=\"Oui\",F38=\"Oui\"),\"Oui\",IF(G38=\"-\",\"Oui\",IF(OR(E38>VLOOKUP($B38,'SeuilsComparaison-EMT'!$C$5:$J$24,4,FALSE),C38>VLOOKUP($B38,'SeuilsComparaison-EMT'!$C$5:$J$24,4,FALSE)=TRUE),IF(C38<=VLOOKUP($B38,'SeuilsComparaison-EMT'!$C$5:$J$24,5,FALSE),IF(ABS(G38)<=VLOOKUP($B38,'SeuilsComparaison-EMT'!$C$5:$J$24,6,FALSE),\"Oui\",\"Non\"),IF(ABS(G38)<=VLOOKUP($B38,'SeuilsComparaison-EMT'!$C$5:$J$24,8,FALSE),\"Oui\",\"Non\")),\"Oui\"))))","v":""},null,null,null,null,{"$f":"IF(OR(K38=\"\",I38=\"\"),\"\",IF(ISERROR(VLOOKUP($B38,'SeuilsComparaison-EMT'!$C$5:$J$24,4,FALSE)),\"-\",IF(OR(IF(ISTEXT(K38)=TRUE,SUBSTITUTE(K38,\"<\",\"\",1)*1,K38)>VLOOKUP($B38,'SeuilsComparaison-EMT'!$C$5:$J$24,4,FALSE),IF(ISTEXT(I38)=TRUE,SUBSTITUTE(I38,\"<\",\"\",1)*1,I38)>VLOOKUP($B38,'SeuilsComparaison-EMT'!$C$5:$J$24,4,FALSE)=TRUE),(IF(ISTEXT(I38)=TRUE,SUBSTITUTE(I38,\"<\",\"\",1)*1,I38)-((IF(ISTEXT(I38)=TRUE,SUBSTITUTE(I38,\"<\",\"\",1)*1,I38)+IF(ISTEXT(K38)=TRUE,SUBSTITUTE(K38,\"<\",\"\",1)*1,K38))/2))/((IF(ISTEXT(I38)=TRUE,SUBSTITUTE(I38,\"<\",\"\",1)*1,I38)+IF(ISTEXT(K38)=TRUE,SUBSTITUTE(K38,\"<\",\"\",1),K38))/2),\"-\")))","v":""},{"$f":"IF(OR(K38=\"\",I38=\"\"),\"\",IF(AND(J38=\"Oui\",L38=\"Oui\"),\"Oui\",IF(M38=\"-\",\"Oui\",IF(OR(K38>VLOOKUP($B38,'SeuilsComparaison-EMT'!$C$5:$J$24,4,FALSE),I38>VLOOKUP($B38,'SeuilsComparaison-EMT'!$C$5:$J$24,4,FALSE)=TRUE),IF(I38<=VLOOKUP($B38,'SeuilsComparaison-EMT'!$C$5:$J$24,5,FALSE),IF(ABS(M38)<=VLOOKUP($B38,'SeuilsComparaison-EMT'!$C$5:$J$24,6,FALSE),\"Oui\",\"Non\"),IF(ABS(M38)<=VLOOKUP($B38,'SeuilsComparaison-EMT'!$C$5:$J$24,8,FALSE),\"Oui\",\"Non\")),\"Oui\"))))","v":""},null,null,null,null,{"$f":"IF(OR(Q38=\"\",O38=\"\"),\"\",IF(ISERROR(VLOOKUP($B38,'SeuilsComparaison-EMT'!$C$5:$J$24,4,FALSE)),\"-\",IF(OR(IF(ISTEXT(Q38)=TRUE,SUBSTITUTE(Q38,\"<\",\"\",1)*1,Q38)>VLOOKUP($B38,'SeuilsComparaison-EMT'!$C$5:$J$24,4,FALSE),IF(ISTEXT(O38)=TRUE,SUBSTITUTE(O38,\"<\",\"\",1)*1,O38)>VLOOKUP($B38,'SeuilsComparaison-EMT'!$C$5:$J$24,4,FALSE)=TRUE),(IF(ISTEXT(O38)=TRUE,SUBSTITUTE(O38,\"<\",\"\",1)*1,O38)-((IF(ISTEXT(O38)=TRUE,SUBSTITUTE(O38,\"<\",\"\",1)*1,O38)+IF(ISTEXT(Q38)=TRUE,SUBSTITUTE(Q38,\"<\",\"\",1)*1,Q38))/2))/((IF(ISTEXT(O38)=TRUE,SUBSTITUTE(O38,\"<\",\"\",1)*1,O38)+IF(ISTEXT(Q38)=TRUE,SUBSTITUTE(Q38,\"<\",\"\",1),Q38))/2),\"-\")))","v":""},{"$f":"IF(OR(Q38=\"\",O38=\"\"),\"\",IF(AND(P38=\"Oui\",R38=\"Oui\"),\"Oui\",IF(S38=\"-\",\"Oui\",IF(OR(Q38>VLOOKUP($B38,'SeuilsComparaison-EMT'!$C$5:$J$24,4,FALSE),O38>VLOOKUP($B38,'SeuilsComparaison-EMT'!$C$5:$J$24,4,FALSE)=TRUE),IF(O38<=VLOOKUP($B38,'SeuilsComparaison-EMT'!$C$5:$J$24,5,FALSE),IF(ABS(S38)<=VLOOKUP($B38,'SeuilsComparaison-EMT'!$C$5:$J$24,6,FALSE),\"Oui\",\"Non\"),IF(ABS(S38)<=VLOOKUP($B38,'SeuilsComparaison-EMT'!$C$5:$J$24,8,FALSE),\"Oui\",\"Non\")),\"Oui\"))))","v":""}]
[null,"PT",null,null,null,null,{"$f":"IF(OR(E39=\"\",C39=\"\"),\"\",IF(ISERROR(VLOOKUP($B39,'SeuilsComparaison-EMT'!$C$5:$J$24,4,FALSE)),\"-\",IF(OR(IF(ISTEXT(E39)=TRUE,SUBSTITUTE(E39,\"<\",\"\",1)*1,E39)>VLOOKUP($B39,'SeuilsComparaison-EMT'!$C$5:$J$24,4,FALSE),IF(ISTEXT(C39)=TRUE,SUBSTITUTE(C39,\"<\",\"\",1)*1,C39)>VLOOKUP($B39,'SeuilsComparaison-EMT'!$C$5:$J$24,4,FALSE)=TRUE),(IF(ISTEXT(C39)=TRUE,SUBSTITUTE(C39,\"<\",\"\",1)*1,C39)-((IF(ISTEXT(C39)=TRUE,SUBSTITUTE(C39,\"<\",\"\",1)*1,C39)+IF(ISTEXT(E39)=TRUE,SUBSTITUTE(E39,\"<\",\"\",1)*1,E39))/2))/((IF(ISTEXT(C39)=TRUE,SUBSTITUTE(C39,\"<\",\"\",1)*1,C39)+IF(ISTEXT(E39)=TRUE,SUBSTITUTE(E39,\"<\",\"\",1),E39))/2),\"-\")))","v":""},{"$f":"IF(OR(E39=\"\",C39=\"\"),\"\",IF(AND(D39=\"Oui\",F39=\"Oui\"),\"Oui\",IF(G39=\"-\",\"Oui\",IF(OR(E39>VLOOKUP($B39,'SeuilsComparaison-EMT'!$C$5:$J$24,4,FALSE),C39>VLOOKUP($B39,'SeuilsComparaison-EMT'!$C$5:$J$24,4,FALSE)=TRUE),IF(C39<=VLOOKUP($B39,'SeuilsComparaison-EMT'!$C$5:$J$24,5,FALSE),IF(ABS(G39)<=VLOOKUP($B39,'SeuilsComparaison-EMT'!$C$5:$J$24,6,FALSE),\"Oui\",\"Non\"),IF(ABS(G39)<=VLOOKUP($B39,'SeuilsComparaison-EMT'!$C$5:$J$24,8,FALSE),\"Oui\",\"Non\")),\"Oui\"))))","v":""},null,null,null,null,{"$f":"IF(OR(K39=\"\",I39=\"\"),\"\",IF(ISERROR(VLOOKUP($B39,'SeuilsComparaison-EMT'!$C$5:$J$24,4,FALSE)),\"-\",IF(OR(IF(ISTEXT(K39)=TRUE,SUBSTITUTE(K39,\"<\",\"\",1)*1,K39)>VLOOKUP($B39,'SeuilsComparaison-EMT'!$C$5:$J$24,4,FALSE),IF(ISTEXT(I39)=TRUE,SUBSTITUTE(I39,\"<\",\"\",1)*1,I39)>VLOOKUP($B39,'SeuilsComparaison-EMT'!$C$5:$J$24,4,FALSE)=TRUE),(IF(ISTEXT(I39)=TRUE,SUBSTITUTE(I39,\"<\",\"\",1)*1,I39)-((IF(ISTEXT(I39)=TRUE,SUBSTITUTE(I39,\"<\",\"\",1)*1,I39)+IF(ISTEXT(K39)=TRUE,SUBSTITUTE(K39,\"<\",\"\",1)*1,K39))/2))/((IF(ISTEXT(I39)=TRUE,SUBSTITUTE(I39,\"<\",\"\",1)*1,I39)+IF(ISTEXT(K39)=TRUE,SUBSTITUTE(K39,\"<\",\"\",1),K39))/2),\"-\")))","v":""},{"$f":"IF(OR(K39=\"\",I39=\"\"),\"\",IF(AND(J39=\"Oui\",L39=\"Oui\"),\"Oui\",IF(M39=\"-\",\"Oui\",IF(OR(K39>VLOOKUP($B39,'SeuilsComparaison-EMT'!$C$5:$J$24,4,FALSE),I39>VLOOKUP($B39,'SeuilsComparaison-EMT'!$C$5:$J$24,4,FALSE)=TRUE),IF(I39<=VLOOKUP($B39,'SeuilsComparaison-EMT'!$C$5:$J$24,5,FALSE),IF(ABS(M39)<=VLOOKUP($B39,'SeuilsComparaison-EMT'!$C$5:$J$24,6,FALSE),\"Oui\",\"Non\"),IF(ABS(M39)<=VLOOKUP($B39,'SeuilsComparaison-EMT'!$C$5:$J$24,8,FALSE),\"Oui\",\"Non\")),\"Oui\"))))","v":""},null,null,null,null,{"$f":"IF(OR(Q39=\"\",O39=\"\"),\"\",IF(ISERROR(VLOOKUP($B39,'SeuilsComparaison-EMT'!$C$5:$J$24,4,FALSE)),\"-\",IF(OR(IF(ISTEXT(Q39)=TRUE,SUBSTITUTE(Q39,\"<\",\"\",1)*1,Q39)>VLOOKUP($B39,'SeuilsComparaison-EMT'!$C$5:$J$24,4,FALSE),IF(ISTEXT(O39)=TRUE,SUBSTITUTE(O39,\"<\",\"\",1)*1,O39)>VLOOKUP($B39,'SeuilsComparaison-EMT'!$C$5:$J$24,4,FALSE)=TRUE),(IF(ISTEXT(O39)=TRUE,SUBSTITUTE(O39,\"<\",\"\",1)*1,O39)-((IF(ISTEXT(O39)=TRUE,SUBSTITUTE(O39,\"<\",\"\",1)*1,O39)+IF(ISTEXT(Q39)=TRUE,SUBSTITUTE(Q39,\"<\",\"\",1)*1,Q39))/2))/((IF(ISTEXT(O39)=TRUE,SUBSTITUTE(O39,\"<\",\"\",1)*1,O39)+IF(ISTEXT(Q39)=TRUE,SUBSTITUTE(Q39,\"<\",\"\",1),Q39))/2),\"-\")))","v":""},{"$f":"IF(OR(Q39=\"\",O39=\"\"),\"\",IF(AND(P39=\"Oui\",R39=\"Oui\"),\"Oui\",IF(S39=\"-\",\"Oui\",IF(OR(Q39>VLOOKUP($B39,'SeuilsComparaison-EMT'!$C$5:$J$24,4,FALSE),O39>VLOOKUP($B39,'SeuilsComparaison-EMT'!$C$5:$J$24,4,FALSE)=TRUE),IF(O39<=VLOOKUP($B39,'SeuilsComparaison-EMT'!$C$5:$J$24,5,FALSE),IF(ABS(S39)<=VLOOKUP($B39,'SeuilsComparaison-EMT'!$C$5:$J$24,6,FALSE),\"Oui\",\"Non\"),IF(ABS(S39)<=VLOOKUP($B39,'SeuilsComparaison-EMT'!$C$5:$J$24,8,FALSE),\"Oui\",\"Non\")),\"Oui\"))))","v":""}]
[null,"MI",null,null,null,null,{"$f":"IF(OR(E40=\"\",C40=\"\"),\"\",IF(ISERROR(VLOOKUP($B40,'SeuilsComparaison-EMT'!$C$5:$J$24,4,FALSE)),\"-\",IF(OR(IF(ISTEXT(E40)=TRUE,SUBSTITUTE(E40,\"<\",\"\",1)*1,E40)>VLOOKUP($B40,'SeuilsComparaison-EMT'!$C$5:$J$24,4,FALSE),IF(ISTEXT(C40)=TRUE,SUBSTITUTE(C40,\"<\",\"\",1)*1,C40)>VLOOKUP($B40,'SeuilsComparaison-EMT'!$C$5:$J$24,4,FALSE)=TRUE),(IF(ISTEXT(C40)=TRUE,SUBSTITUTE(C40,\"<\",\"\",1)*1,C40)-((IF(ISTEXT(C40)=TRUE,SUBSTITUTE(C40,\"<\",\"\",1)*1,C40)+IF(ISTEXT(E40)=TRUE,SUBSTITUTE(E40,\"<\",\"\",1)*1,E40))/2))/((IF(ISTEXT(C40)=TRUE,SUBSTITUTE(C40,\"<\",\"\",1)*1,C40)+IF(ISTEXT(E40)=TRUE,SUBSTITUTE(E40,\"<\",\"\",1),E40))/2),\"-\")))","v":""},{"$f":"IF(OR(E40=\"\",C40=\"\"),\"\",IF(AND(D40=\"Oui\",F40=\"Oui\"),\"Oui\",IF(G40=\"-\",\"Oui\",IF(OR(E40>VLOOKUP($B40,'SeuilsComparaison-EMT'!$C$5:$J$24,4,FALSE),C40>VLOOKUP($B40,'SeuilsComparaison-EMT'!$C$5:$J$24,4,FALSE)=TRUE),IF(C40<=VLOOKUP($B40,'SeuilsComparaison-EMT'!$C$5:$J$24,5,FALSE),IF(ABS(G40)<=VLOOKUP($B40,'SeuilsComparaison-EMT'!$C$5:$J$24,6,FALSE),\"Oui\",\"Non\"),IF(ABS(G40)<=VLOOKUP($B40,'SeuilsComparaison-EMT'!$C$5:$J$24,8,FALSE),\"Oui\",\"Non\")),\"Oui\"))))","v":""},null,null,null,null,{"$f":"IF(OR(K40=\"\",I40=\"\"),\"\",IF(ISERROR(VLOOKUP($B40,'SeuilsComparaison-EMT'!$C$5:$J$24,4,FALSE)),\"-\",IF(OR(IF(ISTEXT(K40)=TRUE,SUBSTITUTE(K40,\"<\",\"\",1)*1,K40)>VLOOKUP($B40,'SeuilsComparaison-EMT'!$C$5:$J$24,4,FALSE),IF(ISTEXT(I40)=TRUE,SUBSTITUTE(I40,\"<\",\"\",1)*1,I40)>VLOOKUP($B40,'SeuilsComparaison-EMT'!$C$5:$J$24,4,FALSE)=TRUE),(IF(ISTEXT(I40)=TRUE,SUBSTITUTE(I40,\"<\",\"\",1)*1,I40)-((IF(ISTEXT(I40)=TRUE,SUBSTITUTE(I40,\"<\",\"\",1)*1,I40)+IF(ISTEXT(K40)=TRUE,SUBSTITUTE(K40,\"<\",\"\",1)*1,K40))/2))/((IF(ISTEXT(I40)=TRUE,SUBSTITUTE(I40,\"<\",\"\",1)*1,I40)+IF(ISTEXT(K40)=TRUE,SUBSTITUTE(K40,\"<\",\"\",1),K40))/2),\"-\")))","v":""},{"$f":"IF(OR(K40=\"\",I40=\"\"),\"\",IF(AND(J40=\"Oui\",L40=\"Oui\"),\"Oui\",IF(M40=\"-\",\"Oui\",IF(OR(K40>VLOOKUP($B40,'SeuilsComparaison-EMT'!$C$5:$J$24,4,FALSE),I40>VLOOKUP($B40,'SeuilsComparaison-EMT'!$C$5:$J$24,4,FALSE)=TRUE),IF(I40<=VLOOKUP($B40,'SeuilsComparaison-EMT'!$C$5:$J$24,5,FALSE),IF(ABS(M40)<=VLOOKUP($B40,'SeuilsComparaison-EMT'!$C$5:$J$24,6,FALSE),\"Oui\",\"Non\"),IF(ABS(M40)<=VLOOKUP($B40,'SeuilsComparaison-EMT'!$C$5:$J$24,8,FALSE),\"Oui\",\"Non\")),\"Oui\"))))","v":""},null,null,null,null,{"$f":"IF(OR(Q40=\"\",O40=\"\"),\"\",IF(ISERROR(VLOOKUP($B40,'SeuilsComparaison-EMT'!$C$5:$J$24,4,FALSE)),\"-\",IF(OR(IF(ISTEXT(Q40)=TRUE,SUBSTITUTE(Q40,\"<\",\"\",1)*1,Q40)>VLOOKUP($B40,'SeuilsComparaison-EMT'!$C$5:$J$24,4,FALSE),IF(ISTEXT(O40)=TRUE,SUBSTITUTE(O40,\"<\",\"\",1)*1,O40)>VLOOKUP($B40,'SeuilsComparaison-EMT'!$C$5:$J$24,4,FALSE)=TRUE),(IF(ISTEXT(O40)=TRUE,SUBSTITUTE(O40,\"<\",\"\",1)*1,O40)-((IF(ISTEXT(O40)=TRUE,SUBSTITUTE(O40,\"<\",\"\",1)*1,O40)+IF(ISTEXT(Q40)=TRUE,SUBSTITUTE(Q40,\"<\",\"\",1)*1,Q40))/2))/((IF(ISTEXT(O40)=TRUE,SUBSTITUTE(O40,\"<\",\"\",1)*1,O40)+IF(ISTEXT(Q40)=TRUE,SUBSTITUTE(Q40,\"<\",\"\",1),Q40))/2),\"-\")))","v":""},{"$f":"IF(OR(Q40=\"\",O40=\"\"),\"\",IF(AND(P40=\"Oui\",R40=\"Oui\"),\"Oui\",IF(S40=\"-\",\"Oui\",IF(OR(Q40>VLOOKUP($B40,'SeuilsComparaison-EMT'!$C$5:$J$24,4,FALSE),O40>VLOOKUP($B40,'SeuilsComparaison-EMT'!$C$5:$J$24,4,FALSE)=TRUE),IF(O40<=VLOOKUP($B40,'SeuilsComparaison-EMT'!$C$5:$J$24,5,FALSE),IF(ABS(S40)<=VLOOKUP($B40,'SeuilsComparaison-EMT'!$C$5:$J$24,6,FALSE),\"Oui\",\"Non\"),IF(ABS(S40)<=VLOOKUP($B40,'SeuilsComparaison-EMT'!$C$5:$J$24,8,FALSE),\"Oui\",\"Non\")),\"Oui\"))))","v":""}]
[null,"AOX",null,null,null,null,{"$f":"IF(OR(E41=\"\",C41=\"\"),\"\",IF(ISERROR(VLOOKUP($B41,'SeuilsComparaison-EMT'!$C$5:$J$24,4,FALSE)),\"-\",IF(OR(IF(ISTEXT(E41)=TRUE,SUBSTITUTE(E41,\"<\",\"\",1)*1,E41)>VLOOKUP($B41,'SeuilsComparaison-EMT'!$C$5:$J$24,4,FALSE),IF(ISTEXT(C41)=TRUE,SUBSTITUTE(C41,\"<\",\"\",1)*1,C41)>VLOOKUP($B41,'SeuilsComparaison-EMT'!$C$5:$J$24,4,FALSE)=TRUE),(IF(ISTEXT(C41)=TRUE,SUBSTITUTE(C41,\"<\",\"\",1)*1,C41)-((IF(ISTEXT(C41)=TRUE,SUBSTITUTE(C41,\"<\",\"\",1)*1,C41)+IF(ISTEXT(E41)=TRUE,SUBSTITUTE(E41,\"<\",\"\",1)*1,E41))/2))/((IF(ISTEXT(C41)=TRUE,SUBSTITUTE(C41,\"<\",\"\",1)*1,C41)+IF(ISTEXT(E41)=TRUE,SUBSTITUTE(E41,\"<\",\"\",1),E41))/2),\"-\")))","v":""},{"$f":"IF(OR(E41=\"\",C41=\"\"),\"\",IF(AND(D41=\"Oui\",F41=\"Oui\"),\"Oui\",IF(G41=\"-\",\"Oui\",IF(OR(E41>VLOOKUP($B41,'SeuilsComparaison-EMT'!$C$5:$J$24,4,FALSE),C41>VLOOKUP($B41,'SeuilsComparaison-EMT'!$C$5:$J$24,4,FALSE)=TRUE),IF(C41<=VLOOKUP($B41,'SeuilsComparaison-EMT'!$C$5:$J$24,5,FALSE),IF(ABS(G41)<=VLOOKUP($B41,'SeuilsComparaison-EMT'!$C$5:$J$24,6,FALSE),\"Oui\",\"Non\"),IF(ABS(G41)<=VLOOKUP($B41,'SeuilsComparaison-EMT'!$C$5:$J$24,8,FALSE),\"Oui\",\"Non\")),\"Oui\"))))","v":""},null,null,null,null,{"$f":"IF(OR(K41=\"\",I41=\"\"),\"\",IF(ISERROR(VLOOKUP($B41,'SeuilsComparaison-EMT'!$C$5:$J$24,4,FALSE)),\"-\",IF(OR(IF(ISTEXT(K41)=TRUE,SUBSTITUTE(K41,\"<\",\"\",1)*1,K41)>VLOOKUP($B41,'SeuilsComparaison-EMT'!$C$5:$J$24,4,FALSE),IF(ISTEXT(I41)=TRUE,SUBSTITUTE(I41,\"<\",\"\",1)*1,I41)>VLOOKUP($B41,'SeuilsComparaison-EMT'!$C$5:$J$24,4,FALSE)=TRUE),(IF(ISTEXT(I41)=TRUE,SUBSTITUTE(I41,\"<\",\"\",1)*1,I41)-((IF(ISTEXT(I41)=TRUE,SUBSTITUTE(I41,\"<\",\"\",1)*1,I41)+IF(ISTEXT(K41)=TRUE,SUBSTITUTE(K41,\"<\",\"\",1)*1,K41))/2))/((IF(ISTEXT(I41)=TRUE,SUBSTITUTE(I41,\"<\",\"\",1)*1,I41)+IF(ISTEXT(K41)=TRUE,SUBSTITUTE(K41,\"<\",\"\",1),K41))/2),\"-\")))","v":""},{"$f":"IF(OR(K41=\"\",I41=\"\"),\"\",IF(AND(J41=\"Oui\",L41=\"Oui\"),\"Oui\",IF(M41=\"-\",\"Oui\",IF(OR(K41>VLOOKUP($B41,'SeuilsComparaison-EMT'!$C$5:$J$24,4,FALSE),I41>VLOOKUP($B41,'SeuilsComparaison-EMT'!$C$5:$J$24,4,FALSE)=TRUE),IF(I41<=VLOOKUP($B41,'SeuilsComparaison-EMT'!$C$5:$J$24,5,FALSE),IF(ABS(M41)<=VLOOKUP($B41,'SeuilsComparaison-EMT'!$C$5:$J$24,6,FALSE),\"Oui\",\"Non\"),IF(ABS(M41)<=VLOOKUP($B41,'SeuilsComparaison-EMT'!$C$5:$J$24,8,FALSE),\"Oui\",\"Non\")),\"Oui\"))))","v":""},null,null,null,null,{"$f":"IF(OR(Q41=\"\",O41=\"\"),\"\",IF(ISERROR(VLOOKUP($B41,'SeuilsComparaison-EMT'!$C$5:$J$24,4,FALSE)),\"-\",IF(OR(IF(ISTEXT(Q41)=TRUE,SUBSTITUTE(Q41,\"<\",\"\",1)*1,Q41)>VLOOKUP($B41,'SeuilsComparaison-EMT'!$C$5:$J$24,4,FALSE),IF(ISTEXT(O41)=TRUE,SUBSTITUTE(O41,\"<\",\"\",1)*1,O41)>VLOOKUP($B41,'SeuilsComparaison-EMT'!$C$5:$J$24,4,FALSE)=TRUE),(IF(ISTEXT(O41)=TRUE,SUBSTITUTE(O41,\"<\",\"\",1)*1,O41)-((IF(ISTEXT(O41)=TRUE,SUBSTITUTE(O41,\"<\",\"\",1)*1,O41)+IF(ISTEXT(Q41)=TRUE,SUBSTITUTE(Q41,\"<\",\"\",1)*1,Q41))/2))/((IF(ISTEXT(O41)=TRUE,SUBSTITUTE(O41,\"<\",\"\",1)*1,O41)+IF(ISTEXT(Q41)=TRUE,SUBSTITUTE(Q41,\"<\",\"\",1),Q41))/2),\"-\")))","v":""},{"$f":"IF(OR(Q41=\"\",O41=\"\"),\"\",IF(AND(P41=\"Oui\",R41=\"Oui\"),\"Oui\",IF(S41=\"-\",\"Oui\",IF(OR(Q41>VLOOKUP($B41,'SeuilsComparaison-EMT'!$C$5:$J$24,4,FALSE),O41>VLOOKUP($B41,'SeuilsComparaison-EMT'!$C$5:$J$24,4,FALSE)=TRUE),IF(O41<=VLOOKUP($B41,'SeuilsComparaison-EMT'!$C$5:$J$24,5,FALSE),IF(ABS(S41)<=VLOOKUP($B41,'SeuilsComparaison-EMT'!$C$5:$J$24,6,FALSE),\"Oui\",\"Non\"),IF(ABS(S41)<=VLOOKUP($B41,'SeuilsComparaison-EMT'!$C$5:$J$24,8,FALSE),\"Oui\",\"Non\")),\"Oui\"))))","v":""}]
[null,"As",null,null,null,null,{"$f":"IF(OR(E42=\"\",C42=\"\"),\"\",IF(ISERROR(VLOOKUP($B42,'SeuilsComparaison-EMT'!$C$5:$J$24,4,FALSE)),\"-\",IF(OR(IF(ISTEXT(E42)=TRUE,SUBSTITUTE(E42,\"<\",\"\",1)*1,E42)>VLOOKUP($B42,'SeuilsComparaison-EMT'!$C$5:$J$24,4,FALSE),IF(ISTEXT(C42)=TRUE,SUBSTITUTE(C42,\"<\",\"\",1)*1,C42)>VLOOKUP($B42,'SeuilsComparaison-EMT'!$C$5:$J$24,4,FALSE)=TRUE),(IF(ISTEXT(C42)=TRUE,SUBSTITUTE(C42,\"<\",\"\",1)*1,C42)-((IF(ISTEXT(C42)=TRUE,SUBSTITUTE(C42,\"<\",\"\",1)*1,C42)+IF(ISTEXT(E42)=TRUE,SUBSTITUTE(E42,\"<\",\"\",1)*1,E42))/2))/((IF(ISTEXT(C42)=TRUE,SUBSTITUTE(C42,\"<\",\"\",1)*1,C42)+IF(ISTEXT(E42)=TRUE,SUBSTITUTE(E42,\"<\",\"\",1),E42))/2),\"-\")))","v":""},{"$f":"IF(OR(E42=\"\",C42=\"\"),\"\",IF(AND(D42=\"Oui\",F42=\"Oui\"),\"Oui\",IF(G42=\"-\",\"Oui\",IF(OR(E42>VLOOKUP($B42,'SeuilsComparaison-EMT'!$C$5:$J$24,4,FALSE),C42>VLOOKUP($B42,'SeuilsComparaison-EMT'!$C$5:$J$24,4,FALSE)=TRUE),IF(C42<=VLOOKUP($B42,'SeuilsComparaison-EMT'!$C$5:$J$24,5,FALSE),IF(ABS(G42)<=VLOOKUP($B42,'SeuilsComparaison-EMT'!$C$5:$J$24,6,FALSE),\"Oui\",\"Non\"),IF(ABS(G42)<=VLOOKUP($B42,'SeuilsComparaison-EMT'!$C$5:$J$24,8,FALSE),\"Oui\",\"Non\")),\"Oui\"))))","v":""},null,null,null,null,{"$f":"IF(OR(K42=\"\",I42=\"\"),\"\",IF(ISERROR(VLOOKUP($B42,'SeuilsComparaison-EMT'!$C$5:$J$24,4,FALSE)),\"-\",IF(OR(IF(ISTEXT(K42)=TRUE,SUBSTITUTE(K42,\"<\",\"\",1)*1,K42)>VLOOKUP($B42,'SeuilsComparaison-EMT'!$C$5:$J$24,4,FALSE),IF(ISTEXT(I42)=TRUE,SUBSTITUTE(I42,\"<\",\"\",1)*1,I42)>VLOOKUP($B42,'SeuilsComparaison-EMT'!$C$5:$J$24,4,FALSE)=TRUE),(IF(ISTEXT(I42)=TRUE,SUBSTITUTE(I42,\"<\",\"\",1)*1,I42)-((IF(ISTEXT(I42)=TRUE,SUBSTITUTE(I42,\"<\",\"\",1)*1,I42)+IF(ISTEXT(K42)=TRUE,SUBSTITUTE(K42,\"<\",\"\",1)*1,K42))/2))/((IF(ISTEXT(I42)=TRUE,SUBSTITUTE(I42,\"<\",\"\",1)*1,I42)+IF(ISTEXT(K42)=TRUE,SUBSTITUTE(K42,\"<\",\"\",1),K42))/2),\"-\")))","v":""},{"$f":"IF(OR(K42=\"\",I42=\"\"),\"\",IF(AND(J42=\"Oui\",L42=\"Oui\"),\"Oui\",IF(M42=\"-\",\"Oui\",IF(OR(K42>VLOOKUP($B42,'SeuilsComparaison-EMT'!$C$5:$J$24,4,FALSE),I42>VLOOKUP($B42,'SeuilsComparaison-EMT'!$C$5:$J$24,4,FALSE)=TRUE),IF(I42<=VLOOKUP($B42,'SeuilsComparaison-EMT'!$C$5:$J$24,5,FALSE),IF(ABS(M42)<=VLOOKUP($B42,'SeuilsComparaison-EMT'!$C$5:$J$24,6,FALSE),\"Oui\",\"Non\"),IF(ABS(M42)<=VLOOKUP($B42,'SeuilsComparaison-EMT'!$C$5:$J$24,8,FALSE),\"Oui\",\"Non\")),\"Oui\"))))","v":""},null,null,null,null,{"$f":"IF(OR(Q42=\"\",O42=\"\"),\"\",IF(ISERROR(VLOOKUP($B42,'SeuilsComparaison-EMT'!$C$5:$J$24,4,FALSE)),\"-\",IF(OR(IF(ISTEXT(Q42)=TRUE,SUBSTITUTE(Q42,\"<\",\"\",1)*1,Q42)>VLOOKUP($B42,'SeuilsComparaison-EMT'!$C$5:$J$24,4,FALSE),IF(ISTEXT(O42)=TRUE,SUBSTITUTE(O42,\"<\",\"\",1)*1,O42)>VLOOKUP($B42,'SeuilsComparaison-EMT'!$C$5:$J$24,4,FALSE)=TRUE),(IF(ISTEXT(O42)=TRUE,SUBSTITUTE(O42,\"<\",\"\",1)*1,O42)-((IF(ISTEXT(O42)=TRUE,SUBSTITUTE(O42,\"<\",\"\",1)*1,O42)+IF(ISTEXT(Q42)=TRUE,SUBSTITUTE(Q42,\"<\",\"\",1)*1,Q42))/2))/((IF(ISTEXT(O42)=TRUE,SUBSTITUTE(O42,\"<\",\"\",1)*1,O42)+IF(ISTEXT(Q42)=TRUE,SUBSTITUTE(Q42,\"<\",\"\",1),Q42))/2),\"-\")))","v":""},{"$f":"IF(OR(Q42=\"\",O42=\"\"),\"\",IF(AND(P42=\"Oui\",R42=\"Oui\"),\"Oui\",IF(S42=\"-\",\"Oui\",IF(OR(Q42>VLOOKUP($B42,'SeuilsComparaison-EMT'!$C$5:$J$24,4,FALSE),O42>VLOOKUP($B42,'SeuilsComparaison-EMT'!$C$5:$J$24,4,FALSE)=TRUE),IF(O42<=VLOOKUP($B42,'SeuilsComparaison-EMT'!$C$5:$J$24,5,FALSE),IF(ABS(S42)<=VLOOKUP($B42,'SeuilsComparaison-EMT'!$C$5:$J$24,6,FALSE),\"Oui\",\"Non\"),IF(ABS(S42)<=VLOOKUP($B42,'SeuilsComparaison-EMT'!$C$5:$J$24,8,FALSE),\"Oui\",\"Non\")),\"Oui\"))))","v":""}]
[null,"Cd",null,null,null,null,{"$f":"IF(OR(E43=\"\",C43=\"\"),\"\",IF(ISERROR(VLOOKUP($B43,'SeuilsComparaison-EMT'!$C$5:$J$24,4,FALSE)),\"-\",IF(OR(IF(ISTEXT(E43)=TRUE,SUBSTITUTE(E43,\"<\",\"\",1)*1,E43)>VLOOKUP($B43,'SeuilsComparaison-EMT'!$C$5:$J$24,4,FALSE),IF(ISTEXT(C43)=TRUE,SUBSTITUTE(C43,\"<\",\"\",1)*1,C43)>VLOOKUP($B43,'SeuilsComparaison-EMT'!$C$5:$J$24,4,FALSE)=TRUE),(IF(ISTEXT(C43)=TRUE,SUBSTITUTE(C43,\"<\",\"\",1)*1,C43)-((IF(ISTEXT(C43)=TRUE,SUBSTITUTE(C43,\"<\",\"\",1)*1,C43)+IF(ISTEXT(E43)=TRUE,SUBSTITUTE(E43,\"<\",\"\",1)*1,E43))/2))/((IF(ISTEXT(C43)=TRUE,SUBSTITUTE(C43,\"<\",\"\",1)*1,C43)+IF(ISTEXT(E43)=TRUE,SUBSTITUTE(E43,\"<\",\"\",1),E43))/2),\"-\")))","v":""},{"$f":"IF(OR(E43=\"\",C43=\"\"),\"\",IF(AND(D43=\"Oui\",F43=\"Oui\"),\"Oui\",IF(G43=\"-\",\"Oui\",IF(OR(E43>VLOOKUP($B43,'SeuilsComparaison-EMT'!$C$5:$J$24,4,FALSE),C43>VLOOKUP($B43,'SeuilsComparaison-EMT'!$C$5:$J$24,4,FALSE)=TRUE),IF(C43<=VLOOKUP($B43,'SeuilsComparaison-EMT'!$C$5:$J$24,5,FALSE),IF(ABS(G43)<=VLOOKUP($B43,'SeuilsComparaison-EMT'!$C$5:$J$24,6,FALSE),\"Oui\",\"Non\"),IF(ABS(G43)<=VLOOKUP($B43,'SeuilsComparaison-EMT'!$C$5:$J$24,8,FALSE),\"Oui\",\"Non\")),\"Oui\"))))","v":""},null,null,null,null,{"$f":"IF(OR(K43=\"\",I43=\"\"),\"\",IF(ISERROR(VLOOKUP($B43,'SeuilsComparaison-EMT'!$C$5:$J$24,4,FALSE)),\"-\",IF(OR(IF(ISTEXT(K43)=TRUE,SUBSTITUTE(K43,\"<\",\"\",1)*1,K43)>VLOOKUP($B43,'SeuilsComparaison-EMT'!$C$5:$J$24,4,FALSE),IF(ISTEXT(I43)=TRUE,SUBSTITUTE(I43,\"<\",\"\",1)*1,I43)>VLOOKUP($B43,'SeuilsComparaison-EMT'!$C$5:$J$24,4,FALSE)=TRUE),(IF(ISTEXT(I43)=TRUE,SUBSTITUTE(I43,\"<\",\"\",1)*1,I43)-((IF(ISTEXT(I43)=TRUE,SUBSTITUTE(I43,\"<\",\"\",1)*1,I43)+IF(ISTEXT(K43)=TRUE,SUBSTITUTE(K43,\"<\",\"\",1)*1,K43))/2))/((IF(ISTEXT(I43)=TRUE,SUBSTITUTE(I43,\"<\",\"\",1)*1,I43)+IF(ISTEXT(K43)=TRUE,SUBSTITUTE(K43,\"<\",\"\",1),K43))/2),\"-\")))","v":""},{"$f":"IF(OR(K43=\"\",I43=\"\"),\"\",IF(AND(J43=\"Oui\",L43=\"Oui\"),\"Oui\",IF(M43=\"-\",\"Oui\",IF(OR(K43>VLOOKUP($B43,'SeuilsComparaison-EMT'!$C$5:$J$24,4,FALSE),I43>VLOOKUP($B43,'SeuilsComparaison-EMT'!$C$5:$J$24,4,FALSE)=TRUE),IF(I43<=VLOOKUP($B43,'SeuilsComparaison-EMT'!$C$5:$J$24,5,FALSE),IF(ABS(M43)<=VLOOKUP($B43,'SeuilsComparaison-EMT'!$C$5:$J$24,6,FALSE),\"Oui\",\"Non\"),IF(ABS(M43)<=VLOOKUP($B43,'SeuilsComparaison-EMT'!$C$5:$J$24,8,FALSE),\"Oui\",\"Non\")),\"Oui\"))))","v":""},null,null,null,null,{"$f":"IF(OR(Q43=\"\",O43=\"\"),\"\",IF(ISERROR(VLOOKUP($B43,'SeuilsComparaison-EMT'!$C$5:$J$24,4,FALSE)),\"-\",IF(OR(IF(ISTEXT(Q43)=TRUE,SUBSTITUTE(Q43,\"<\",\"\",1)*1,Q43)>VLOOKUP($B43,'SeuilsComparaison-EMT'!$C$5:$J$24,4,FALSE),IF(ISTEXT(O43)=TRUE,SUBSTITUTE(O43,\"<\",\"\",1)*1,O43)>VLOOKUP($B43,'SeuilsComparaison-EMT'!$C$5:$J$24,4,FALSE)=TRUE),(IF(ISTEXT(O43)=TRUE,SUBSTITUTE(O43,\"<\",\"\",1)*1,O43)-((IF(ISTEXT(O43)=TRUE,SUBSTITUTE(O43,\"<\",\"\",1)*1,O43)+IF(ISTEXT(Q43)=TRUE,SUBSTITUTE(Q43,\"<\",\"\",1)*1,Q43))/2))/((IF(ISTEXT(O43)=TRUE,SUBSTITUTE(O43,\"<\",\"\",1)*1,O43)+IF(ISTEXT(Q43)=TRUE,SUBSTITUTE(Q43,\"<\",\"\",1),Q43))/2),\"-\")))","v":""},{"$f":"IF(OR(Q43=\"\",O43=\"\"),\"\",IF(AND(P43=\"Oui\",R43=\"Oui\"),\"Oui\",IF(S43=\"-\",\"Oui\",IF(OR(Q43>VLOOKUP($B43,'SeuilsComparaison-EMT'!$C$5:$J$24,4,FALSE),O43>VLOOKUP($B43,'SeuilsComparaison-EMT'!$C$5:$J$24,4,FALSE)=TRUE),IF(O43<=VLOOKUP($B43,'SeuilsComparaison-EMT'!$C$5:$J$24,5,FALSE),IF(ABS(S43)<=VLOOKUP($B43,'SeuilsComparaison-EMT'!$C$5:$J$24,6,FALSE),\"Oui\",\"Non\"),IF(ABS(S43)<=VLOOKUP($B43,'SeuilsComparaison-EMT'!$C$5:$J$24,8,FALSE),\"Oui\",\"Non\")),\"Oui\"))))","v":""}]
[null,"Cr",null,null,null,null,{"$f":"IF(OR(E44=\"\",C44=\"\"),\"\",IF(ISERROR(VLOOKUP($B44,'SeuilsComparaison-EMT'!$C$5:$J$24,4,FALSE)),\"-\",IF(OR(IF(ISTEXT(E44)=TRUE,SUBSTITUTE(E44,\"<\",\"\",1)*1,E44)>VLOOKUP($B44,'SeuilsComparaison-EMT'!$C$5:$J$24,4,FALSE),IF(ISTEXT(C44)=TRUE,SUBSTITUTE(C44,\"<\",\"\",1)*1,C44)>VLOOKUP($B44,'SeuilsComparaison-EMT'!$C$5:$J$24,4,FALSE)=TRUE),(IF(ISTEXT(C44)=TRUE,SUBSTITUTE(C44,\"<\",\"\",1)*1,C44)-((IF(ISTEXT(C44)=TRUE,SUBSTITUTE(C44,\"<\",\"\",1)*1,C44)+IF(ISTEXT(E44)=TRUE,SUBSTITUTE(E44,\"<\",\"\",1)*1,E44))/2))/((IF(ISTEXT(C44)=TRUE,SUBSTITUTE(C44,\"<\",\"\",1)*1,C44)+IF(ISTEXT(E44)=TRUE,SUBSTITUTE(E44,\"<\",\"\",1),E44))/2),\"-\")))","v":""},{"$f":"IF(OR(E44=\"\",C44=\"\"),\"\",IF(AND(D44=\"Oui\",F44=\"Oui\"),\"Oui\",IF(G44=\"-\",\"Oui\",IF(OR(E44>VLOOKUP($B44,'SeuilsComparaison-EMT'!$C$5:$J$24,4,FALSE),C44>VLOOKUP($B44,'SeuilsComparaison-EMT'!$C$5:$J$24,4,FALSE)=TRUE),IF(C44<=VLOOKUP($B44,'SeuilsComparaison-EMT'!$C$5:$J$24,5,FALSE),IF(ABS(G44)<=VLOOKUP($B44,'SeuilsComparaison-EMT'!$C$5:$J$24,6,FALSE),\"Oui\",\"Non\"),IF(ABS(G44)<=VLOOKUP($B44,'SeuilsComparaison-EMT'!$C$5:$J$24,8,FALSE),\"Oui\",\"Non\")),\"Oui\"))))","v":""},null,null,null,null,{"$f":"IF(OR(K44=\"\",I44=\"\"),\"\",IF(ISERROR(VLOOKUP($B44,'SeuilsComparaison-EMT'!$C$5:$J$24,4,FALSE)),\"-\",IF(OR(IF(ISTEXT(K44)=TRUE,SUBSTITUTE(K44,\"<\",\"\",1)*1,K44)>VLOOKUP($B44,'SeuilsComparaison-EMT'!$C$5:$J$24,4,FALSE),IF(ISTEXT(I44)=TRUE,SUBSTITUTE(I44,\"<\",\"\",1)*1,I44)>VLOOKUP($B44,'SeuilsComparaison-EMT'!$C$5:$J$24,4,FALSE)=TRUE),(IF(ISTEXT(I44)=TRUE,SUBSTITUTE(I44,\"<\",\"\",1)*1,I44)-((IF(ISTEXT(I44)=TRUE,SUBSTITUTE(I44,\"<\",\"\",1)*1,I44)+IF(ISTEXT(K44)=TRUE,SUBSTITUTE(K44,\"<\",\"\",1)*1,K44))/2))/((IF(ISTEXT(I44)=TRUE,SUBSTITUTE(I44,\"<\",\"\",1)*1,I44)+IF(ISTEXT(K44)=TRUE,SUBSTITUTE(K44,\"<\",\"\",1),K44))/2),\"-\")))","v":""},{"$f":"IF(OR(K44=\"\",I44=\"\"),\"\",IF(AND(J44=\"Oui\",L44=\"Oui\"),\"Oui\",IF(M44=\"-\",\"Oui\",IF(OR(K44>VLOOKUP($B44,'SeuilsComparaison-EMT'!$C$5:$J$24,4,FALSE),I44>VLOOKUP($B44,'SeuilsComparaison-EMT'!$C$5:$J$24,4,FALSE)=TRUE),IF(I44<=VLOOKUP($B44,'SeuilsComparaison-EMT'!$C$5:$J$24,5,FALSE),IF(ABS(M44)<=VLOOKUP($B44,'SeuilsComparaison-EMT'!$C$5:$J$24,6,FALSE),\"Oui\",\"Non\"),IF(ABS(M44)<=VLOOKUP($B44,'SeuilsComparaison-EMT'!$C$5:$J$24,8,FALSE),\"Oui\",\"Non\")),\"Oui\"))))","v":""},null,null,null,null,{"$f":"IF(OR(Q44=\"\",O44=\"\"),\"\",IF(ISERROR(VLOOKUP($B44,'SeuilsComparaison-EMT'!$C$5:$J$24,4,FALSE)),\"-\",IF(OR(IF(ISTEXT(Q44)=TRUE,SUBSTITUTE(Q44,\"<\",\"\",1)*1,Q44)>VLOOKUP($B44,'SeuilsComparaison-EMT'!$C$5:$J$24,4,FALSE),IF(ISTEXT(O44)=TRUE,SUBSTITUTE(O44,\"<\",\"\",1)*1,O44)>VLOOKUP($B44,'SeuilsComparaison-EMT'!$C$5:$J$24,4,FALSE)=TRUE),(IF(ISTEXT(O44)=TRUE,SUBSTITUTE(O44,\"<\",\"\",1)*1,O44)-((IF(ISTEXT(O44)=TRUE,SUBSTITUTE(O44,\"<\",\"\",1)*1,O44)+IF(ISTEXT(Q44)=TRUE,SUBSTITUTE(Q44,\"<\",\"\",1)*1,Q44))/2))/((IF(ISTEXT(O44)=TRUE,SUBSTITUTE(O44,\"<\",\"\",1)*1,O44)+IF(ISTEXT(Q44)=TRUE,SUBSTITUTE(Q44,\"<\",\"\",1),Q44))/2),\"-\")))","v":""},{"$f":"IF(OR(Q44=\"\",O44=\"\"),\"\",IF(AND(P44=\"Oui\",R44=\"Oui\"),\"Oui\",IF(S44=\"-\",\"Oui\",IF(OR(Q44>VLOOKUP($B44,'SeuilsComparaison-EMT'!$C$5:$J$24,4,FALSE),O44>VLOOKUP($B44,'SeuilsComparaison-EMT'!$C$5:$J$24,4,FALSE)=TRUE),IF(O44<=VLOOKUP($B44,'SeuilsComparaison-EMT'!$C$5:$J$24,5,FALSE),IF(ABS(S44)<=VLOOKUP($B44,'SeuilsComparaison-EMT'!$C$5:$J$24,6,FALSE),\"Oui\",\"Non\"),IF(ABS(S44)<=VLOOKUP($B44,'SeuilsComparaison-EMT'!$C$5:$J$24,8,FALSE),\"Oui\",\"Non\")),\"Oui\"))))","v":""}]
[null,"Cu",null,null,null,null,{"$f":"IF(OR(E45=\"\",C45=\"\"),\"\",IF(ISERROR(VLOOKUP($B45,'SeuilsComparaison-EMT'!$C$5:$J$24,4,FALSE)),\"-\",IF(OR(IF(ISTEXT(E45)=TRUE,SUBSTITUTE(E45,\"<\",\"\",1)*1,E45)>VLOOKUP($B45,'SeuilsComparaison-EMT'!$C$5:$J$24,4,FALSE),IF(ISTEXT(C45)=TRUE,SUBSTITUTE(C45,\"<\",\"\",1)*1,C45)>VLOOKUP($B45,'SeuilsComparaison-EMT'!$C$5:$J$24,4,FALSE)=TRUE),(IF(ISTEXT(C45)=TRUE,SUBSTITUTE(C45,\"<\",\"\",1)*1,C45)-((IF(ISTEXT(C45)=TRUE,SUBSTITUTE(C45,\"<\",\"\",1)*1,C45)+IF(ISTEXT(E45)=TRUE,SUBSTITUTE(E45,\"<\",\"\",1)*1,E45))/2))/((IF(ISTEXT(C45)=TRUE,SUBSTITUTE(C45,\"<\",\"\",1)*1,C45)+IF(ISTEXT(E45)=TRUE,SUBSTITUTE(E45,\"<\",\"\",1),E45))/2),\"-\")))","v":""},{"$f":"IF(OR(E45=\"\",C45=\"\"),\"\",IF(AND(D45=\"Oui\",F45=\"Oui\"),\"Oui\",IF(G45=\"-\",\"Oui\",IF(OR(E45>VLOOKUP($B45,'SeuilsComparaison-EMT'!$C$5:$J$24,4,FALSE),C45>VLOOKUP($B45,'SeuilsComparaison-EMT'!$C$5:$J$24,4,FALSE)=TRUE),IF(C45<=VLOOKUP($B45,'SeuilsComparaison-EMT'!$C$5:$J$24,5,FALSE),IF(ABS(G45)<=VLOOKUP($B45,'SeuilsComparaison-EMT'!$C$5:$J$24,6,FALSE),\"Oui\",\"Non\"),IF(ABS(G45)<=VLOOKUP($B45,'SeuilsComparaison-EMT'!$C$5:$J$24,8,FALSE),\"Oui\",\"Non\")),\"Oui\"))))","v":""},null,null,null,null,{"$f":"IF(OR(K45=\"\",I45=\"\"),\"\",IF(ISERROR(VLOOKUP($B45,'SeuilsComparaison-EMT'!$C$5:$J$24,4,FALSE)),\"-\",IF(OR(IF(ISTEXT(K45)=TRUE,SUBSTITUTE(K45,\"<\",\"\",1)*1,K45)>VLOOKUP($B45,'SeuilsComparaison-EMT'!$C$5:$J$24,4,FALSE),IF(ISTEXT(I45)=TRUE,SUBSTITUTE(I45,\"<\",\"\",1)*1,I45)>VLOOKUP($B45,'SeuilsComparaison-EMT'!$C$5:$J$24,4,FALSE)=TRUE),(IF(ISTEXT(I45)=TRUE,SUBSTITUTE(I45,\"<\",\"\",1)*1,I45)-((IF(ISTEXT(I45)=TRUE,SUBSTITUTE(I45,\"<\",\"\",1)*1,I45)+IF(ISTEXT(K45)=TRUE,SUBSTITUTE(K45,\"<\",\"\",1)*1,K45))/2))/((IF(ISTEXT(I45)=TRUE,SUBSTITUTE(I45,\"<\",\"\",1)*1,I45)+IF(ISTEXT(K45)=TRUE,SUBSTITUTE(K45,\"<\",\"\",1),K45))/2),\"-\")))","v":""},{"$f":"IF(OR(K45=\"\",I45=\"\"),\"\",IF(AND(J45=\"Oui\",L45=\"Oui\"),\"Oui\",IF(M45=\"-\",\"Oui\",IF(OR(K45>VLOOKUP($B45,'SeuilsComparaison-EMT'!$C$5:$J$24,4,FALSE),I45>VLOOKUP($B45,'SeuilsComparaison-EMT'!$C$5:$J$24,4,FALSE)=TRUE),IF(I45<=VLOOKUP($B45,'SeuilsComparaison-EMT'!$C$5:$J$24,5,FALSE),IF(ABS(M45)<=VLOOKUP($B45,'SeuilsComparaison-EMT'!$C$5:$J$24,6,FALSE),\"Oui\",\"Non\"),IF(ABS(M45)<=VLOOKUP($B45,'SeuilsComparaison-EMT'!$C$5:$J$24,8,FALSE),\"Oui\",\"Non\")),\"Oui\"))))","v":""},null,null,null,null,{"$f":"IF(OR(Q45=\"\",O45=\"\"),\"\",IF(ISERROR(VLOOKUP($B45,'SeuilsComparaison-EMT'!$C$5:$J$24,4,FALSE)),\"-\",IF(OR(IF(ISTEXT(Q45)=TRUE,SUBSTITUTE(Q45,\"<\",\"\",1)*1,Q45)>VLOOKUP($B45,'SeuilsComparaison-EMT'!$C$5:$J$24,4,FALSE),IF(ISTEXT(O45)=TRUE,SUBSTITUTE(O45,\"<\",\"\",1)*1,O45)>VLOOKUP($B45,'SeuilsComparaison-EMT'!$C$5:$J$24,4,FALSE)=TRUE),(IF(ISTEXT(O45)=TRUE,SUBSTITUTE(O45,\"<\",\"\",1)*1,O45)-((IF(ISTEXT(O45)=TRUE,SUBSTITUTE(O45,\"<\",\"\",1)*1,O45)+IF(ISTEXT(Q45)=TRUE,SUBSTITUTE(Q45,\"<\",\"\",1)*1,Q45))/2))/((IF(ISTEXT(O45)=TRUE,SUBSTITUTE(O45,\"<\",\"\",1)*1,O45)+IF(ISTEXT(Q45)=TRUE,SUBSTITUTE(Q45,\"<\",\"\",1),Q45))/2),\"-\")))","v":""},{"$f":"IF(OR(Q45=\"\",O45=\"\"),\"\",IF(AND(P45=\"Oui\",R45=\"Oui\"),\"Oui\",IF(S45=\"-\",\"Oui\",IF(OR(Q45>VLOOKUP($B45,'SeuilsComparaison-EMT'!$C$5:$J$24,4,FALSE),O45>VLOOKUP($B45,'SeuilsComparaison-EMT'!$C$5:$J$24,4,FALSE)=TRUE),IF(O45<=VLOOKUP($B45,'SeuilsComparaison-EMT'!$C$5:$J$24,5,FALSE),IF(ABS(S45)<=VLOOKUP($B45,'SeuilsComparaison-EMT'!$C$5:$J$24,6,FALSE),\"Oui\",\"Non\"),IF(ABS(S45)<=VLOOKUP($B45,'SeuilsComparaison-EMT'!$C$5:$J$24,8,FALSE),\"Oui\",\"Non\")),\"Oui\"))))","v":""}]
[null,"Hg",null,null,null,null,{"$f":"IF(OR(E46=\"\",C46=\"\"),\"\",IF(ISERROR(VLOOKUP($B46,'SeuilsComparaison-EMT'!$C$5:$J$24,4,FALSE)),\"-\",IF(OR(IF(ISTEXT(E46)=TRUE,SUBSTITUTE(E46,\"<\",\"\",1)*1,E46)>VLOOKUP($B46,'SeuilsComparaison-EMT'!$C$5:$J$24,4,FALSE),IF(ISTEXT(C46)=TRUE,SUBSTITUTE(C46,\"<\",\"\",1)*1,C46)>VLOOKUP($B46,'SeuilsComparaison-EMT'!$C$5:$J$24,4,FALSE)=TRUE),(IF(ISTEXT(C46)=TRUE,SUBSTITUTE(C46,\"<\",\"\",1)*1,C46)-((IF(ISTEXT(C46)=TRUE,SUBSTITUTE(C46,\"<\",\"\",1)*1,C46)+IF(ISTEXT(E46)=TRUE,SUBSTITUTE(E46,\"<\",\"\",1)*1,E46))/2))/((IF(ISTEXT(C46)=TRUE,SUBSTITUTE(C46,\"<\",\"\",1)*1,C46)+IF(ISTEXT(E46)=TRUE,SUBSTITUTE(E46,\"<\",\"\",1),E46))/2),\"-\")))","v":""},{"$f":"IF(OR(E46=\"\",C46=\"\"),\"\",IF(AND(D46=\"Oui\",F46=\"Oui\"),\"Oui\",IF(G46=\"-\",\"Oui\",IF(OR(E46>VLOOKUP($B46,'SeuilsComparaison-EMT'!$C$5:$J$24,4,FALSE),C46>VLOOKUP($B46,'SeuilsComparaison-EMT'!$C$5:$J$24,4,FALSE)=TRUE),IF(C46<=VLOOKUP($B46,'SeuilsComparaison-EMT'!$C$5:$J$24,5,FALSE),IF(ABS(G46)<=VLOOKUP($B46,'SeuilsComparaison-EMT'!$C$5:$J$24,6,FALSE),\"Oui\",\"Non\"),IF(ABS(G46)<=VLOOKUP($B46,'SeuilsComparaison-EMT'!$C$5:$J$24,8,FALSE),\"Oui\",\"Non\")),\"Oui\"))))","v":""},null,null,null,null,{"$f":"IF(OR(K46=\"\",I46=\"\"),\"\",IF(ISERROR(VLOOKUP($B46,'SeuilsComparaison-EMT'!$C$5:$J$24,4,FALSE)),\"-\",IF(OR(IF(ISTEXT(K46)=TRUE,SUBSTITUTE(K46,\"<\",\"\",1)*1,K46)>VLOOKUP($B46,'SeuilsComparaison-EMT'!$C$5:$J$24,4,FALSE),IF(ISTEXT(I46)=TRUE,SUBSTITUTE(I46,\"<\",\"\",1)*1,I46)>VLOOKUP($B46,'SeuilsComparaison-EMT'!$C$5:$J$24,4,FALSE)=TRUE),(IF(ISTEXT(I46)=TRUE,SUBSTITUTE(I46,\"<\",\"\",1)*1,I46)-((IF(ISTEXT(I46)=TRUE,SUBSTITUTE(I46,\"<\",\"\",1)*1,I46)+IF(ISTEXT(K46)=TRUE,SUBSTITUTE(K46,\"<\",\"\",1)*1,K46))/2))/((IF(ISTEXT(I46)=TRUE,SUBSTITUTE(I46,\"<\",\"\",1)*1,I46)+IF(ISTEXT(K46)=TRUE,SUBSTITUTE(K46,\"<\",\"\",1),K46))/2),\"-\")))","v":""},{"$f":"IF(OR(K46=\"\",I46=\"\"),\"\",IF(AND(J46=\"Oui\",L46=\"Oui\"),\"Oui\",IF(M46=\"-\",\"Oui\",IF(OR(K46>VLOOKUP($B46,'SeuilsComparaison-EMT'!$C$5:$J$24,4,FALSE),I46>VLOOKUP($B46,'SeuilsComparaison-EMT'!$C$5:$J$24,4,FALSE)=TRUE),IF(I46<=VLOOKUP($B46,'SeuilsComparaison-EMT'!$C$5:$J$24,5,FALSE),IF(ABS(M46)<=VLOOKUP($B46,'SeuilsComparaison-EMT'!$C$5:$J$24,6,FALSE),\"Oui\",\"Non\"),IF(ABS(M46)<=VLOOKUP($B46,'SeuilsComparaison-EMT'!$C$5:$J$24,8,FALSE),\"Oui\",\"Non\")),\"Oui\"))))","v":""},null,null,null,null,{"$f":"IF(OR(Q46=\"\",O46=\"\"),\"\",IF(ISERROR(VLOOKUP($B46,'SeuilsComparaison-EMT'!$C$5:$J$24,4,FALSE)),\"-\",IF(OR(IF(ISTEXT(Q46)=TRUE,SUBSTITUTE(Q46,\"<\",\"\",1)*1,Q46)>VLOOKUP($B46,'SeuilsComparaison-EMT'!$C$5:$J$24,4,FALSE),IF(ISTEXT(O46)=TRUE,SUBSTITUTE(O46,\"<\",\"\",1)*1,O46)>VLOOKUP($B46,'SeuilsComparaison-EMT'!$C$5:$J$24,4,FALSE)=TRUE),(IF(ISTEXT(O46)=TRUE,SUBSTITUTE(O46,\"<\",\"\",1)*1,O46)-((IF(ISTEXT(O46)=TRUE,SUBSTITUTE(O46,\"<\",\"\",1)*1,O46)+IF(ISTEXT(Q46)=TRUE,SUBSTITUTE(Q46,\"<\",\"\",1)*1,Q46))/2))/((IF(ISTEXT(O46)=TRUE,SUBSTITUTE(O46,\"<\",\"\",1)*1,O46)+IF(ISTEXT(Q46)=TRUE,SUBSTITUTE(Q46,\"<\",\"\",1),Q46))/2),\"-\")))","v":""},{"$f":"IF(OR(Q46=\"\",O46=\"\"),\"\",IF(AND(P46=\"Oui\",R46=\"Oui\"),\"Oui\",IF(S46=\"-\",\"Oui\",IF(OR(Q46>VLOOKUP($B46,'SeuilsComparaison-EMT'!$C$5:$J$24,4,FALSE),O46>VLOOKUP($B46,'SeuilsComparaison-EMT'!$C$5:$J$24,4,FALSE)=TRUE),IF(O46<=VLOOKUP($B46,'SeuilsComparaison-EMT'!$C$5:$J$24,5,FALSE),IF(ABS(S46)<=VLOOKUP($B46,'SeuilsComparaison-EMT'!$C$5:$J$24,6,FALSE),\"Oui\",\"Non\"),IF(ABS(S46)<=VLOOKUP($B46,'SeuilsComparaison-EMT'!$C$5:$J$24,8,FALSE),\"Oui\",\"Non\")),\"Oui\"))))","v":""}]
[null,"Ni",null,null,null,null,{"$f":"IF(OR(E47=\"\",C47=\"\"),\"\",IF(ISERROR(VLOOKUP($B47,'SeuilsComparaison-EMT'!$C$5:$J$24,4,FALSE)),\"-\",IF(OR(IF(ISTEXT(E47)=TRUE,SUBSTITUTE(E47,\"<\",\"\",1)*1,E47)>VLOOKUP($B47,'SeuilsComparaison-EMT'!$C$5:$J$24,4,FALSE),IF(ISTEXT(C47)=TRUE,SUBSTITUTE(C47,\"<\",\"\",1)*1,C47)>VLOOKUP($B47,'SeuilsComparaison-EMT'!$C$5:$J$24,4,FALSE)=TRUE),(IF(ISTEXT(C47)=TRUE,SUBSTITUTE(C47,\"<\",\"\",1)*1,C47)-((IF(ISTEXT(C47)=TRUE,SUBSTITUTE(C47,\"<\",\"\",1)*1,C47)+IF(ISTEXT(E47)=TRUE,SUBSTITUTE(E47,\"<\",\"\",1)*1,E47))/2))/((IF(ISTEXT(C47)=TRUE,SUBSTITUTE(C47,\"<\",\"\",1)*1,C47)+IF(ISTEXT(E47)=TRUE,SUBSTITUTE(E47,\"<\",\"\",1),E47))/2),\"-\")))","v":""},{"$f":"IF(OR(E47=\"\",C47=\"\"),\"\",IF(AND(D47=\"Oui\",F47=\"Oui\"),\"Oui\",IF(G47=\"-\",\"Oui\",IF(OR(E47>VLOOKUP($B47,'SeuilsComparaison-EMT'!$C$5:$J$24,4,FALSE),C47>VLOOKUP($B47,'SeuilsComparaison-EMT'!$C$5:$J$24,4,FALSE)=TRUE),IF(C47<=VLOOKUP($B47,'SeuilsComparaison-EMT'!$C$5:$J$24,5,FALSE),IF(ABS(G47)<=VLOOKUP($B47,'SeuilsComparaison-EMT'!$C$5:$J$24,6,FALSE),\"Oui\",\"Non\"),IF(ABS(G47)<=VLOOKUP($B47,'SeuilsComparaison-EMT'!$C$5:$J$24,8,FALSE),\"Oui\",\"Non\")),\"Oui\"))))","v":""},null,null,null,null,{"$f":"IF(OR(K47=\"\",I47=\"\"),\"\",IF(ISERROR(VLOOKUP($B47,'SeuilsComparaison-EMT'!$C$5:$J$24,4,FALSE)),\"-\",IF(OR(IF(ISTEXT(K47)=TRUE,SUBSTITUTE(K47,\"<\",\"\",1)*1,K47)>VLOOKUP($B47,'SeuilsComparaison-EMT'!$C$5:$J$24,4,FALSE),IF(ISTEXT(I47)=TRUE,SUBSTITUTE(I47,\"<\",\"\",1)*1,I47)>VLOOKUP($B47,'SeuilsComparaison-EMT'!$C$5:$J$24,4,FALSE)=TRUE),(IF(ISTEXT(I47)=TRUE,SUBSTITUTE(I47,\"<\",\"\",1)*1,I47)-((IF(ISTEXT(I47)=TRUE,SUBSTITUTE(I47,\"<\",\"\",1)*1,I47)+IF(ISTEXT(K47)=TRUE,SUBSTITUTE(K47,\"<\",\"\",1)*1,K47))/2))/((IF(ISTEXT(I47)=TRUE,SUBSTITUTE(I47,\"<\",\"\",1)*1,I47)+IF(ISTEXT(K47)=TRUE,SUBSTITUTE(K47,\"<\",\"\",1),K47))/2),\"-\")))","v":""},{"$f":"IF(OR(K47=\"\",I47=\"\"),\"\",IF(AND(J47=\"Oui\",L47=\"Oui\"),\"Oui\",IF(M47=\"-\",\"Oui\",IF(OR(K47>VLOOKUP($B47,'SeuilsComparaison-EMT'!$C$5:$J$24,4,FALSE),I47>VLOOKUP($B47,'SeuilsComparaison-EMT'!$C$5:$J$24,4,FALSE)=TRUE),IF(I47<=VLOOKUP($B47,'SeuilsComparaison-EMT'!$C$5:$J$24,5,FALSE),IF(ABS(M47)<=VLOOKUP($B47,'SeuilsComparaison-EMT'!$C$5:$J$24,6,FALSE),\"Oui\",\"Non\"),IF(ABS(M47)<=VLOOKUP($B47,'SeuilsComparaison-EMT'!$C$5:$J$24,8,FALSE),\"Oui\",\"Non\")),\"Oui\"))))","v":""},null,null,null,null,{"$f":"IF(OR(Q47=\"\",O47=\"\"),\"\",IF(ISERROR(VLOOKUP($B47,'SeuilsComparaison-EMT'!$C$5:$J$24,4,FALSE)),\"-\",IF(OR(IF(ISTEXT(Q47)=TRUE,SUBSTITUTE(Q47,\"<\",\"\",1)*1,Q47)>VLOOKUP($B47,'SeuilsComparaison-EMT'!$C$5:$J$24,4,FALSE),IF(ISTEXT(O47)=TRUE,SUBSTITUTE(O47,\"<\",\"\",1)*1,O47)>VLOOKUP($B47,'SeuilsComparaison-EMT'!$C$5:$J$24,4,FALSE)=TRUE),(IF(ISTEXT(O47)=TRUE,SUBSTITUTE(O47,\"<\",\"\",1)*1,O47)-((IF(ISTEXT(O47)=TRUE,SUBSTITUTE(O47,\"<\",\"\",1)*1,O47)+IF(ISTEXT(Q47)=TRUE,SUBSTITUTE(Q47,\"<\",\"\",1)*1,Q47))/2))/((IF(ISTEXT(O47)=TRUE,SUBSTITUTE(O47,\"<\",\"\",1)*1,O47)+IF(ISTEXT(Q47)=TRUE,SUBSTITUTE(Q47,\"<\",\"\",1),Q47))/2),\"-\")))","v":""},{"$f":"IF(OR(Q47=\"\",O47=\"\"),\"\",IF(AND(P47=\"Oui\",R47=\"Oui\"),\"Oui\",IF(S47=\"-\",\"Oui\",IF(OR(Q47>VLOOKUP($B47,'SeuilsComparaison-EMT'!$C$5:$J$24,4,FALSE),O47>VLOOKUP($B47,'SeuilsComparaison-EMT'!$C$5:$J$24,4,FALSE)=TRUE),IF(O47<=VLOOKUP($B47,'SeuilsComparaison-EMT'!$C$5:$J$24,5,FALSE),IF(ABS(S47)<=VLOOKUP($B47,'SeuilsComparaison-EMT'!$C$5:$J$24,6,FALSE),\"Oui\",\"Non\"),IF(ABS(S47)<=VLOOKUP($B47,'SeuilsComparaison-EMT'!$C$5:$J$24,8,FALSE),\"Oui\",\"Non\")),\"Oui\"))))","v":""}]
[null,"Pb",null,null,null,null,{"$f":"IF(OR(E48=\"\",C48=\"\"),\"\",IF(ISERROR(VLOOKUP($B48,'SeuilsComparaison-EMT'!$C$5:$J$24,4,FALSE)),\"-\",IF(OR(IF(ISTEXT(E48)=TRUE,SUBSTITUTE(E48,\"<\",\"\",1)*1,E48)>VLOOKUP($B48,'SeuilsComparaison-EMT'!$C$5:$J$24,4,FALSE),IF(ISTEXT(C48)=TRUE,SUBSTITUTE(C48,\"<\",\"\",1)*1,C48)>VLOOKUP($B48,'SeuilsComparaison-EMT'!$C$5:$J$24,4,FALSE)=TRUE),(IF(ISTEXT(C48)=TRUE,SUBSTITUTE(C48,\"<\",\"\",1)*1,C48)-((IF(ISTEXT(C48)=TRUE,SUBSTITUTE(C48,\"<\",\"\",1)*1,C48)+IF(ISTEXT(E48)=TRUE,SUBSTITUTE(E48,\"<\",\"\",1)*1,E48))/2))/((IF(ISTEXT(C48)=TRUE,SUBSTITUTE(C48,\"<\",\"\",1)*1,C48)+IF(ISTEXT(E48)=TRUE,SUBSTITUTE(E48,\"<\",\"\",1),E48))/2),\"-\")))","v":""},{"$f":"IF(OR(E48=\"\",C48=\"\"),\"\",IF(AND(D48=\"Oui\",F48=\"Oui\"),\"Oui\",IF(G48=\"-\",\"Oui\",IF(OR(E48>VLOOKUP($B48,'SeuilsComparaison-EMT'!$C$5:$J$24,4,FALSE),C48>VLOOKUP($B48,'SeuilsComparaison-EMT'!$C$5:$J$24,4,FALSE)=TRUE),IF(C48<=VLOOKUP($B48,'SeuilsComparaison-EMT'!$C$5:$J$24,5,FALSE),IF(ABS(G48)<=VLOOKUP($B48,'SeuilsComparaison-EMT'!$C$5:$J$24,6,FALSE),\"Oui\",\"Non\"),IF(ABS(G48)<=VLOOKUP($B48,'SeuilsComparaison-EMT'!$C$5:$J$24,8,FALSE),\"Oui\",\"Non\")),\"Oui\"))))","v":""},null,null,null,null,{"$f":"IF(OR(K48=\"\",I48=\"\"),\"\",IF(ISERROR(VLOOKUP($B48,'SeuilsComparaison-EMT'!$C$5:$J$24,4,FALSE)),\"-\",IF(OR(IF(ISTEXT(K48)=TRUE,SUBSTITUTE(K48,\"<\",\"\",1)*1,K48)>VLOOKUP($B48,'SeuilsComparaison-EMT'!$C$5:$J$24,4,FALSE),IF(ISTEXT(I48)=TRUE,SUBSTITUTE(I48,\"<\",\"\",1)*1,I48)>VLOOKUP($B48,'SeuilsComparaison-EMT'!$C$5:$J$24,4,FALSE)=TRUE),(IF(ISTEXT(I48)=TRUE,SUBSTITUTE(I48,\"<\",\"\",1)*1,I48)-((IF(ISTEXT(I48)=TRUE,SUBSTITUTE(I48,\"<\",\"\",1)*1,I48)+IF(ISTEXT(K48)=TRUE,SUBSTITUTE(K48,\"<\",\"\",1)*1,K48))/2))/((IF(ISTEXT(I48)=TRUE,SUBSTITUTE(I48,\"<\",\"\",1)*1,I48)+IF(ISTEXT(K48)=TRUE,SUBSTITUTE(K48,\"<\",\"\",1),K48))/2),\"-\")))","v":""},{"$f":"IF(OR(K48=\"\",I48=\"\"),\"\",IF(AND(J48=\"Oui\",L48=\"Oui\"),\"Oui\",IF(M48=\"-\",\"Oui\",IF(OR(K48>VLOOKUP($B48,'SeuilsComparaison-EMT'!$C$5:$J$24,4,FALSE),I48>VLOOKUP($B48,'SeuilsComparaison-EMT'!$C$5:$J$24,4,FALSE)=TRUE),IF(I48<=VLOOKUP($B48,'SeuilsComparaison-EMT'!$C$5:$J$24,5,FALSE),IF(ABS(M48)<=VLOOKUP($B48,'SeuilsComparaison-EMT'!$C$5:$J$24,6,FALSE),\"Oui\",\"Non\"),IF(ABS(M48)<=VLOOKUP($B48,'SeuilsComparaison-EMT'!$C$5:$J$24,8,FALSE),\"Oui\",\"Non\")),\"Oui\"))))","v":""},null,null,null,null,{"$f":"IF(OR(Q48=\"\",O48=\"\"),\"\",IF(ISERROR(VLOOKUP($B48,'SeuilsComparaison-EMT'!$C$5:$J$24,4,FALSE)),\"-\",IF(OR(IF(ISTEXT(Q48)=TRUE,SUBSTITUTE(Q48,\"<\",\"\",1)*1,Q48)>VLOOKUP($B48,'SeuilsComparaison-EMT'!$C$5:$J$24,4,FALSE),IF(ISTEXT(O48)=TRUE,SUBSTITUTE(O48,\"<\",\"\",1)*1,O48)>VLOOKUP($B48,'SeuilsComparaison-EMT'!$C$5:$J$24,4,FALSE)=TRUE),(IF(ISTEXT(O48)=TRUE,SUBSTITUTE(O48,\"<\",\"\",1)*1,O48)-((IF(ISTEXT(O48)=TRUE,SUBSTITUTE(O48,\"<\",\"\",1)*1,O48)+IF(ISTEXT(Q48)=TRUE,SUBSTITUTE(Q48,\"<\",\"\",1)*1,Q48))/2))/((IF(ISTEXT(O48)=TRUE,SUBSTITUTE(O48,\"<\",\"\",1)*1,O48)+IF(ISTEXT(Q48)=TRUE,SUBSTITUTE(Q48,\"<\",\"\",1),Q48))/2),\"-\")))","v":""},{"$f":"IF(OR(Q48=\"\",O48=\"\"),\"\",IF(AND(P48=\"Oui\",R48=\"Oui\"),\"Oui\",IF(S48=\"-\",\"Oui\",IF(OR(Q48>VLOOKUP($B48,'SeuilsComparaison-EMT'!$C$5:$J$24,4,FALSE),O48>VLOOKUP($B48,'SeuilsComparaison-EMT'!$C$5:$J$24,4,FALSE)=TRUE),IF(O48<=VLOOKUP($B48,'SeuilsComparaison-EMT'!$C$5:$J$24,5,FALSE),IF(ABS(S48)<=VLOOKUP($B48,'SeuilsComparaison-EMT'!$C$5:$J$24,6,FALSE),\"Oui\",\"Non\"),IF(ABS(S48)<=VLOOKUP($B48,'SeuilsComparaison-EMT'!$C$5:$J$24,8,FALSE),\"Oui\",\"Non\")),\"Oui\"))))","v":""}]
[null,"Zn",null,null,null,null,{"$f":"IF(OR(E49=\"\",C49=\"\"),\"\",IF(ISERROR(VLOOKUP($B49,'SeuilsComparaison-EMT'!$C$5:$J$24,4,FALSE)),\"-\",IF(OR(IF(ISTEXT(E49)=TRUE,SUBSTITUTE(E49,\"<\",\"\",1)*1,E49)>VLOOKUP($B49,'SeuilsComparaison-EMT'!$C$5:$J$24,4,FALSE),IF(ISTEXT(C49)=TRUE,SUBSTITUTE(C49,\"<\",\"\",1)*1,C49)>VLOOKUP($B49,'SeuilsComparaison-EMT'!$C$5:$J$24,4,FALSE)=TRUE),(IF(ISTEXT(C49)=TRUE,SUBSTITUTE(C49,\"<\",\"\",1)*1,C49)-((IF(ISTEXT(C49)=TRUE,SUBSTITUTE(C49,\"<\",\"\",1)*1,C49)+IF(ISTEXT(E49)=TRUE,SUBSTITUTE(E49,\"<\",\"\",1)*1,E49))/2))/((IF(ISTEXT(C49)=TRUE,SUBSTITUTE(C49,\"<\",\"\",1)*1,C49)+IF(ISTEXT(E49)=TRUE,SUBSTITUTE(E49,\"<\",\"\",1),E49))/2),\"-\")))","v":""},{"$f":"IF(OR(E49=\"\",C49=\"\"),\"\",IF(AND(D49=\"Oui\",F49=\"Oui\"),\"Oui\",IF(G49=\"-\",\"Oui\",IF(OR(E49>VLOOKUP($B49,'SeuilsComparaison-EMT'!$C$5:$J$24,4,FALSE),C49>VLOOKUP($B49,'SeuilsComparaison-EMT'!$C$5:$J$24,4,FALSE)=TRUE),IF(C49<=VLOOKUP($B49,'SeuilsComparaison-EMT'!$C$5:$J$24,5,FALSE),IF(ABS(G49)<=VLOOKUP($B49,'SeuilsComparaison-EMT'!$C$5:$J$24,6,FALSE),\"Oui\",\"Non\"),IF(ABS(G49)<=VLOOKUP($B49,'SeuilsComparaison-EMT'!$C$5:$J$24,8,FALSE),\"Oui\",\"Non\")),\"Oui\"))))","v":""},null,null,null,null,{"$f":"IF(OR(K49=\"\",I49=\"\"),\"\",IF(ISERROR(VLOOKUP($B49,'SeuilsComparaison-EMT'!$C$5:$J$24,4,FALSE)),\"-\",IF(OR(IF(ISTEXT(K49)=TRUE,SUBSTITUTE(K49,\"<\",\"\",1)*1,K49)>VLOOKUP($B49,'SeuilsComparaison-EMT'!$C$5:$J$24,4,FALSE),IF(ISTEXT(I49)=TRUE,SUBSTITUTE(I49,\"<\",\"\",1)*1,I49)>VLOOKUP($B49,'SeuilsComparaison-EMT'!$C$5:$J$24,4,FALSE)=TRUE),(IF(ISTEXT(I49)=TRUE,SUBSTITUTE(I49,\"<\",\"\",1)*1,I49)-((IF(ISTEXT(I49)=TRUE,SUBSTITUTE(I49,\"<\",\"\",1)*1,I49)+IF(ISTEXT(K49)=TRUE,SUBSTITUTE(K49,\"<\",\"\",1)*1,K49))/2))/((IF(ISTEXT(I49)=TRUE,SUBSTITUTE(I49,\"<\",\"\",1)*1,I49)+IF(ISTEXT(K49)=TRUE,SUBSTITUTE(K49,\"<\",\"\",1),K49))/2),\"-\")))","v":""},{"$f":"IF(OR(K49=\"\",I49=\"\"),\"\",IF(AND(J49=\"Oui\",L49=\"Oui\"),\"Oui\",IF(M49=\"-\",\"Oui\",IF(OR(K49>VLOOKUP($B49,'SeuilsComparaison-EMT'!$C$5:$J$24,4,FALSE),I49>VLOOKUP($B49,'SeuilsComparaison-EMT'!$C$5:$J$24,4,FALSE)=TRUE),IF(I49<=VLOOKUP($B49,'SeuilsComparaison-EMT'!$C$5:$J$24,5,FALSE),IF(ABS(M49)<=VLOOKUP($B49,'SeuilsComparaison-EMT'!$C$5:$J$24,6,FALSE),\"Oui\",\"Non\"),IF(ABS(M49)<=VLOOKUP($B49,'SeuilsComparaison-EMT'!$C$5:$J$24,8,FALSE),\"Oui\",\"Non\")),\"Oui\"))))","v":""},null,null,null,null,{"$f":"IF(OR(Q49=\"\",O49=\"\"),\"\",IF(ISERROR(VLOOKUP($B49,'SeuilsComparaison-EMT'!$C$5:$J$24,4,FALSE)),\"-\",IF(OR(IF(ISTEXT(Q49)=TRUE,SUBSTITUTE(Q49,\"<\",\"\",1)*1,Q49)>VLOOKUP($B49,'SeuilsComparaison-EMT'!$C$5:$J$24,4,FALSE),IF(ISTEXT(O49)=TRUE,SUBSTITUTE(O49,\"<\",\"\",1)*1,O49)>VLOOKUP($B49,'SeuilsComparaison-EMT'!$C$5:$J$24,4,FALSE)=TRUE),(IF(ISTEXT(O49)=TRUE,SUBSTITUTE(O49,\"<\",\"\",1)*1,O49)-((IF(ISTEXT(O49)=TRUE,SUBSTITUTE(O49,\"<\",\"\",1)*1,O49)+IF(ISTEXT(Q49)=TRUE,SUBSTITUTE(Q49,\"<\",\"\",1)*1,Q49))/2))/((IF(ISTEXT(O49)=TRUE,SUBSTITUTE(O49,\"<\",\"\",1)*1,O49)+IF(ISTEXT(Q49)=TRUE,SUBSTITUTE(Q49,\"<\",\"\",1),Q49))/2),\"-\")))","v":""},{"$f":"IF(OR(Q49=\"\",O49=\"\"),\"\",IF(AND(P49=\"Oui\",R49=\"Oui\"),\"Oui\",IF(S49=\"-\",\"Oui\",IF(OR(Q49>VLOOKUP($B49,'SeuilsComparaison-EMT'!$C$5:$J$24,4,FALSE),O49>VLOOKUP($B49,'SeuilsComparaison-EMT'!$C$5:$J$24,4,FALSE)=TRUE),IF(O49<=VLOOKUP($B49,'SeuilsComparaison-EMT'!$C$5:$J$24,5,FALSE),IF(ABS(S49)<=VLOOKUP($B49,'SeuilsComparaison-EMT'!$C$5:$J$24,6,FALSE),\"Oui\",\"Non\"),IF(ABS(S49)<=VLOOKUP($B49,'SeuilsComparaison-EMT'!$C$5:$J$24,8,FALSE),\"Oui\",\"Non\")),\"Oui\"))))","v":""}]
[null,"Conductivité",null,null,null,null,{"$f":"IF(OR(E50=\"\",C50=\"\"),\"\",IF(ISERROR(VLOOKUP($B50,'SeuilsComparaison-EMT'!$C$5:$J$24,4,FALSE)),\"-\",IF(OR(IF(ISTEXT(E50)=TRUE,SUBSTITUTE(E50,\"<\",\"\",1)*1,E50)>VLOOKUP($B50,'SeuilsComparaison-EMT'!$C$5:$J$24,4,FALSE),IF(ISTEXT(C50)=TRUE,SUBSTITUTE(C50,\"<\",\"\",1)*1,C50)>VLOOKUP($B50,'SeuilsComparaison-EMT'!$C$5:$J$24,4,FALSE)=TRUE),(IF(ISTEXT(C50)=TRUE,SUBSTITUTE(C50,\"<\",\"\",1)*1,C50)-((IF(ISTEXT(C50)=TRUE,SUBSTITUTE(C50,\"<\",\"\",1)*1,C50)+IF(ISTEXT(E50)=TRUE,SUBSTITUTE(E50,\"<\",\"\",1)*1,E50))/2))/((IF(ISTEXT(C50)=TRUE,SUBSTITUTE(C50,\"<\",\"\",1)*1,C50)+IF(ISTEXT(E50)=TRUE,SUBSTITUTE(E50,\"<\",\"\",1),E50))/2),\"-\")))","v":""},{"$f":"IF(OR(E50=\"\",C50=\"\"),\"\",IF(AND(D50=\"Oui\",F50=\"Oui\"),\"Oui\",IF(G50=\"-\",\"Oui\",IF(OR(E50>VLOOKUP($B50,'SeuilsComparaison-EMT'!$C$5:$J$24,4,FALSE),C50>VLOOKUP($B50,'SeuilsComparaison-EMT'!$C$5:$J$24,4,FALSE)=TRUE),IF(C50<=VLOOKUP($B50,'SeuilsComparaison-EMT'!$C$5:$J$24,5,FALSE),IF(ABS(G50)<=VLOOKUP($B50,'SeuilsComparaison-EMT'!$C$5:$J$24,6,FALSE),\"Oui\",\"Non\"),IF(ABS(G50)<=VLOOKUP($B50,'SeuilsComparaison-EMT'!$C$5:$J$24,8,FALSE),\"Oui\",\"Non\")),\"Oui\"))))","v":""},null,null,null,null,{"$f":"IF(OR(K50=\"\",I50=\"\"),\"\",IF(ISERROR(VLOOKUP($B50,'SeuilsComparaison-EMT'!$C$5:$J$24,4,FALSE)),\"-\",IF(OR(IF(ISTEXT(K50)=TRUE,SUBSTITUTE(K50,\"<\",\"\",1)*1,K50)>VLOOKUP($B50,'SeuilsComparaison-EMT'!$C$5:$J$24,4,FALSE),IF(ISTEXT(I50)=TRUE,SUBSTITUTE(I50,\"<\",\"\",1)*1,I50)>VLOOKUP($B50,'SeuilsComparaison-EMT'!$C$5:$J$24,4,FALSE)=TRUE),(IF(ISTEXT(I50)=TRUE,SUBSTITUTE(I50,\"<\",\"\",1)*1,I50)-((IF(ISTEXT(I50)=TRUE,SUBSTITUTE(I50,\"<\",\"\",1)*1,I50)+IF(ISTEXT(K50)=TRUE,SUBSTITUTE(K50,\"<\",\"\",1)*1,K50))/2))/((IF(ISTEXT(I50)=TRUE,SUBSTITUTE(I50,\"<\",\"\",1)*1,I50)+IF(ISTEXT(K50)=TRUE,SUBSTITUTE(K50,\"<\",\"\",1),K50))/2),\"-\")))","v":""},{"$f":"IF(OR(K50=\"\",I50=\"\"),\"\",IF(AND(J50=\"Oui\",L50=\"Oui\"),\"Oui\",IF(M50=\"-\",\"Oui\",IF(OR(K50>VLOOKUP($B50,'SeuilsComparaison-EMT'!$C$5:$J$24,4,FALSE),I50>VLOOKUP($B50,'SeuilsComparaison-EMT'!$C$5:$J$24,4,FALSE)=TRUE),IF(I50<=VLOOKUP($B50,'SeuilsComparaison-EMT'!$C$5:$J$24,5,FALSE),IF(ABS(M50)<=VLOOKUP($B50,'SeuilsComparaison-EMT'!$C$5:$J$24,6,FALSE),\"Oui\",\"Non\"),IF(ABS(M50)<=VLOOKUP($B50,'SeuilsComparaison-EMT'!$C$5:$J$24,8,FALSE),\"Oui\",\"Non\")),\"Oui\"))))","v":""},null,null,null,null,{"$f":"IF(OR(Q50=\"\",O50=\"\"),\"\",IF(ISERROR(VLOOKUP($B50,'SeuilsComparaison-EMT'!$C$5:$J$24,4,FALSE)),\"-\",IF(OR(IF(ISTEXT(Q50)=TRUE,SUBSTITUTE(Q50,\"<\",\"\",1)*1,Q50)>VLOOKUP($B50,'SeuilsComparaison-EMT'!$C$5:$J$24,4,FALSE),IF(ISTEXT(O50)=TRUE,SUBSTITUTE(O50,\"<\",\"\",1)*1,O50)>VLOOKUP($B50,'SeuilsComparaison-EMT'!$C$5:$J$24,4,FALSE)=TRUE),(IF(ISTEXT(O50)=TRUE,SUBSTITUTE(O50,\"<\",\"\",1)*1,O50)-((IF(ISTEXT(O50)=TRUE,SUBSTITUTE(O50,\"<\",\"\",1)*1,O50)+IF(ISTEXT(Q50)=TRUE,SUBSTITUTE(Q50,\"<\",\"\",1)*1,Q50))/2))/((IF(ISTEXT(O50)=TRUE,SUBSTITUTE(O50,\"<\",\"\",1)*1,O50)+IF(ISTEXT(Q50)=TRUE,SUBSTITUTE(Q50,\"<\",\"\",1),Q50))/2),\"-\")))","v":""},{"$f":"IF(OR(Q50=\"\",O50=\"\"),\"\",IF(AND(P50=\"Oui\",R50=\"Oui\"),\"Oui\",IF(S50=\"-\",\"Oui\",IF(OR(Q50>VLOOKUP($B50,'SeuilsComparaison-EMT'!$C$5:$J$24,4,FALSE),O50>VLOOKUP($B50,'SeuilsComparaison-EMT'!$C$5:$J$24,4,FALSE)=TRUE),IF(O50<=VLOOKUP($B50,'SeuilsComparaison-EMT'!$C$5:$J$24,5,FALSE),IF(ABS(S50)<=VLOOKUP($B50,'SeuilsComparaison-EMT'!$C$5:$J$24,6,FALSE),\"Oui\",\"Non\"),IF(ABS(S50)<=VLOOKUP($B50,'SeuilsComparaison-EMT'!$C$5:$J$24,8,FALSE),\"Oui\",\"Non\")),\"Oui\"))))","v":""}]
[null,"Cl",null,null,null,null,{"$f":"IF(OR(E51=\"\",C51=\"\"),\"\",IF(ISERROR(VLOOKUP($B51,'SeuilsComparaison-EMT'!$C$5:$J$24,4,FALSE)),\"-\",IF(OR(IF(ISTEXT(E51)=TRUE,SUBSTITUTE(E51,\"<\",\"\",1)*1,E51)>VLOOKUP($B51,'SeuilsComparaison-EMT'!$C$5:$J$24,4,FALSE),IF(ISTEXT(C51)=TRUE,SUBSTITUTE(C51,\"<\",\"\",1)*1,C51)>VLOOKUP($B51,'SeuilsComparaison-EMT'!$C$5:$J$24,4,FALSE)=TRUE),(IF(ISTEXT(C51)=TRUE,SUBSTITUTE(C51,\"<\",\"\",1)*1,C51)-((IF(ISTEXT(C51)=TRUE,SUBSTITUTE(C51,\"<\",\"\",1)*1,C51)+IF(ISTEXT(E51)=TRUE,SUBSTITUTE(E51,\"<\",\"\",1)*1,E51))/2))/((IF(ISTEXT(C51)=TRUE,SUBSTITUTE(C51,\"<\",\"\",1)*1,C51)+IF(ISTEXT(E51)=TRUE,SUBSTITUTE(E51,\"<\",\"\",1),E51))/2),\"-\")))","v":""},{"$f":"IF(OR(E51=\"\",C51=\"\"),\"\",IF(AND(D51=\"Oui\",F51=\"Oui\"),\"Oui\",IF(G51=\"-\",\"Oui\",IF(OR(E51>VLOOKUP($B51,'SeuilsComparaison-EMT'!$C$5:$J$24,4,FALSE),C51>VLOOKUP($B51,'SeuilsComparaison-EMT'!$C$5:$J$24,4,FALSE)=TRUE),IF(C51<=VLOOKUP($B51,'SeuilsComparaison-EMT'!$C$5:$J$24,5,FALSE),IF(ABS(G51)<=VLOOKUP($B51,'SeuilsComparaison-EMT'!$C$5:$J$24,6,FALSE),\"Oui\",\"Non\"),IF(ABS(G51)<=VLOOKUP($B51,'SeuilsComparaison-EMT'!$C$5:$J$24,8,FALSE),\"Oui\",\"Non\")),\"Oui\"))))","v":""},null,null,null,null,{"$f":"IF(OR(K51=\"\",I51=\"\"),\"\",IF(ISERROR(VLOOKUP($B51,'SeuilsComparaison-EMT'!$C$5:$J$24,4,FALSE)),\"-\",IF(OR(IF(ISTEXT(K51)=TRUE,SUBSTITUTE(K51,\"<\",\"\",1)*1,K51)>VLOOKUP($B51,'SeuilsComparaison-EMT'!$C$5:$J$24,4,FALSE),IF(ISTEXT(I51)=TRUE,SUBSTITUTE(I51,\"<\",\"\",1)*1,I51)>VLOOKUP($B51,'SeuilsComparaison-EMT'!$C$5:$J$24,4,FALSE)=TRUE),(IF(ISTEXT(I51)=TRUE,SUBSTITUTE(I51,\"<\",\"\",1)*1,I51)-((IF(ISTEXT(I51)=TRUE,SUBSTITUTE(I51,\"<\",\"\",1)*1,I51)+IF(ISTEXT(K51)=TRUE,SUBSTITUTE(K51,\"<\",\"\",1)*1,K51))/2))/((IF(ISTEXT(I51)=TRUE,SUBSTITUTE(I51,\"<\",\"\",1)*1,I51)+IF(ISTEXT(K51)=TRUE,SUBSTITUTE(K51,\"<\",\"\",1),K51))/2),\"-\")))","v":""},{"$f":"IF(OR(K51=\"\",I51=\"\"),\"\",IF(AND(J51=\"Oui\",L51=\"Oui\"),\"Oui\",IF(M51=\"-\",\"Oui\",IF(OR(K51>VLOOKUP($B51,'SeuilsComparaison-EMT'!$C$5:$J$24,4,FALSE),I51>VLOOKUP($B51,'SeuilsComparaison-EMT'!$C$5:$J$24,4,FALSE)=TRUE),IF(I51<=VLOOKUP($B51,'SeuilsComparaison-EMT'!$C$5:$J$24,5,FALSE),IF(ABS(M51)<=VLOOKUP($B51,'SeuilsComparaison-EMT'!$C$5:$J$24,6,FALSE),\"Oui\",\"Non\"),IF(ABS(M51)<=VLOOKUP($B51,'SeuilsComparaison-EMT'!$C$5:$J$24,8,FALSE),\"Oui\",\"Non\")),\"Oui\"))))","v":""},null,null,null,null,{"$f":"IF(OR(Q51=\"\",O51=\"\"),\"\",IF(ISERROR(VLOOKUP($B51,'SeuilsComparaison-EMT'!$C$5:$J$24,4,FALSE)),\"-\",IF(OR(IF(ISTEXT(Q51)=TRUE,SUBSTITUTE(Q51,\"<\",\"\",1)*1,Q51)>VLOOKUP($B51,'SeuilsComparaison-EMT'!$C$5:$J$24,4,FALSE),IF(ISTEXT(O51)=TRUE,SUBSTITUTE(O51,\"<\",\"\",1)*1,O51)>VLOOKUP($B51,'SeuilsComparaison-EMT'!$C$5:$J$24,4,FALSE)=TRUE),(IF(ISTEXT(O51)=TRUE,SUBSTITUTE(O51,\"<\",\"\",1)*1,O51)-((IF(ISTEXT(O51)=TRUE,SUBSTITUTE(O51,\"<\",\"\",1)*1,O51)+IF(ISTEXT(Q51)=TRUE,SUBSTITUTE(Q51,\"<\",\"\",1)*1,Q51))/2))/((IF(ISTEXT(O51)=TRUE,SUBSTITUTE(O51,\"<\",\"\",1)*1,O51)+IF(ISTEXT(Q51)=TRUE,SUBSTITUTE(Q51,\"<\",\"\",1),Q51))/2),\"-\")))","v":""},{"$f":"IF(OR(Q51=\"\",O51=\"\"),\"\",IF(AND(P51=\"Oui\",R51=\"Oui\"),\"Oui\",IF(S51=\"-\",\"Oui\",IF(OR(Q51>VLOOKUP($B51,'SeuilsComparaison-EMT'!$C$5:$J$24,4,FALSE),O51>VLOOKUP($B51,'SeuilsComparaison-EMT'!$C$5:$J$24,4,FALSE)=TRUE),IF(O51<=VLOOKUP($B51,'SeuilsComparaison-EMT'!$C$5:$J$24,5,FALSE),IF(ABS(S51)<=VLOOKUP($B51,'SeuilsComparaison-EMT'!$C$5:$J$24,6,FALSE),\"Oui\",\"Non\"),IF(ABS(S51)<=VLOOKUP($B51,'SeuilsComparaison-EMT'!$C$5:$J$24,8,FALSE),\"Oui\",\"Non\")),\"Oui\"))))","v":""}]
[null,null,null,null,null,null,{"$f":"IF(OR(E52=\"\",C52=\"\"),\"\",IF(ISERROR(VLOOKUP($B52,'SeuilsComparaison-EMT'!$C$5:$J$24,4,FALSE)),\"-\",IF(OR(IF(ISTEXT(E52)=TRUE,SUBSTITUTE(E52,\"<\",\"\",1)*1,E52)>VLOOKUP($B52,'SeuilsComparaison-EMT'!$C$5:$J$24,4,FALSE),IF(ISTEXT(C52)=TRUE,SUBSTITUTE(C52,\"<\",\"\",1)*1,C52)>VLOOKUP($B52,'SeuilsComparaison-EMT'!$C$5:$J$24,4,FALSE)=TRUE),(IF(ISTEXT(C52)=TRUE,SUBSTITUTE(C52,\"<\",\"\",1)*1,C52)-((IF(ISTEXT(C52)=TRUE,SUBSTITUTE(C52,\"<\",\"\",1)*1,C52)+IF(ISTEXT(E52)=TRUE,SUBSTITUTE(E52,\"<\",\"\",1)*1,E52))/2))/((IF(ISTEXT(C52)=TRUE,SUBSTITUTE(C52,\"<\",\"\",1)*1,C52)+IF(ISTEXT(E52)=TRUE,SUBSTITUTE(E52,\"<\",\"\",1),E52))/2),\"-\")))","v":""},{"$f":"IF(OR(E52=\"\",C52=\"\"),\"\",IF(AND(D52=\"Oui\",F52=\"Oui\"),\"Oui\",IF(G52=\"-\",\"Oui\",IF(OR(E52>VLOOKUP($B52,'SeuilsComparaison-EMT'!$C$5:$J$24,4,FALSE),C52>VLOOKUP($B52,'SeuilsComparaison-EMT'!$C$5:$J$24,4,FALSE)=TRUE),IF(C52<=VLOOKUP($B52,'SeuilsComparaison-EMT'!$C$5:$J$24,5,FALSE),IF(ABS(G52)<=VLOOKUP($B52,'SeuilsComparaison-EMT'!$C$5:$J$24,6,FALSE),\"Oui\",\"Non\"),IF(ABS(G52)<=VLOOKUP($B52,'SeuilsComparaison-EMT'!$C$5:$J$24,8,FALSE),\"Oui\",\"Non\")),\"Oui\"))))","v":""},null,null,null,null,{"$f":"IF(OR(K52=\"\",I52=\"\"),\"\",IF(ISERROR(VLOOKUP($B52,'SeuilsComparaison-EMT'!$C$5:$J$24,4,FALSE)),\"-\",IF(OR(IF(ISTEXT(K52)=TRUE,SUBSTITUTE(K52,\"<\",\"\",1)*1,K52)>VLOOKUP($B52,'SeuilsComparaison-EMT'!$C$5:$J$24,4,FALSE),IF(ISTEXT(I52)=TRUE,SUBSTITUTE(I52,\"<\",\"\",1)*1,I52)>VLOOKUP($B52,'SeuilsComparaison-EMT'!$C$5:$J$24,4,FALSE)=TRUE),(IF(ISTEXT(I52)=TRUE,SUBSTITUTE(I52,\"<\",\"\",1)*1,I52)-((IF(ISTEXT(I52)=TRUE,SUBSTITUTE(I52,\"<\",\"\",1)*1,I52)+IF(ISTEXT(K52)=TRUE,SUBSTITUTE(K52,\"<\",\"\",1)*1,K52))/2))/((IF(ISTEXT(I52)=TRUE,SUBSTITUTE(I52,\"<\",\"\",1)*1,I52)+IF(ISTEXT(K52)=TRUE,SUBSTITUTE(K52,\"<\",\"\",1),K52))/2),\"-\")))","v":""},{"$f":"IF(OR(K52=\"\",I52=\"\"),\"\",IF(AND(J52=\"Oui\",L52=\"Oui\"),\"Oui\",IF(M52=\"-\",\"Oui\",IF(OR(K52>VLOOKUP($B52,'SeuilsComparaison-EMT'!$C$5:$J$24,4,FALSE),I52>VLOOKUP($B52,'SeuilsComparaison-EMT'!$C$5:$J$24,4,FALSE)=TRUE),IF(I52<=VLOOKUP($B52,'SeuilsComparaison-EMT'!$C$5:$J$24,5,FALSE),IF(ABS(M52)<=VLOOKUP($B52,'SeuilsComparaison-EMT'!$C$5:$J$24,6,FALSE),\"Oui\",\"Non\"),IF(ABS(M52)<=VLOOKUP($B52,'SeuilsComparaison-EMT'!$C$5:$J$24,8,FALSE),\"Oui\",\"Non\")),\"Oui\"))))","v":""},null,null,null,null,{"$f":"IF(OR(Q52=\"\",O52=\"\"),\"\",IF(ISERROR(VLOOKUP($B52,'SeuilsComparaison-EMT'!$C$5:$J$24,4,FALSE)),\"-\",IF(OR(IF(ISTEXT(Q52)=TRUE,SUBSTITUTE(Q52,\"<\",\"\",1)*1,Q52)>VLOOKUP($B52,'SeuilsComparaison-EMT'!$C$5:$J$24,4,FALSE),IF(ISTEXT(O52)=TRUE,SUBSTITUTE(O52,\"<\",\"\",1)*1,O52)>VLOOKUP($B52,'SeuilsComparaison-EMT'!$C$5:$J$24,4,FALSE)=TRUE),(IF(ISTEXT(O52)=TRUE,SUBSTITUTE(O52,\"<\",\"\",1)*1,O52)-((IF(ISTEXT(O52)=TRUE,SUBSTITUTE(O52,\"<\",\"\",1)*1,O52)+IF(ISTEXT(Q52)=TRUE,SUBSTITUTE(Q52,\"<\",\"\",1)*1,Q52))/2))/((IF(ISTEXT(O52)=TRUE,SUBSTITUTE(O52,\"<\",\"\",1)*1,O52)+IF(ISTEXT(Q52)=TRUE,SUBSTITUTE(Q52,\"<\",\"\",1),Q52))/2),\"-\")))","v":""},{"$f":"IF(OR(Q52=\"\",O52=\"\"),\"\",IF(AND(P52=\"Oui\",R52=\"Oui\"),\"Oui\",IF(S52=\"-\",\"Oui\",IF(OR(Q52>VLOOKUP($B52,'SeuilsComparaison-EMT'!$C$5:$J$24,4,FALSE),O52>VLOOKUP($B52,'SeuilsComparaison-EMT'!$C$5:$J$24,4,FALSE)=TRUE),IF(O52<=VLOOKUP($B52,'SeuilsComparaison-EMT'!$C$5:$J$24,5,FALSE),IF(ABS(S52)<=VLOOKUP($B52,'SeuilsComparaison-EMT'!$C$5:$J$24,6,FALSE),\"Oui\",\"Non\"),IF(ABS(S52)<=VLOOKUP($B52,'SeuilsComparaison-EMT'!$C$5:$J$24,8,FALSE),\"Oui\",\"Non\")),\"Oui\"))))","v":""}]
[]
[null,"Identifier en jaune les résultats d'analyse produits par le laboratoire interne "]
[]
[null,"Paramètres",{"$f":"IF(SynthèseContrôle!$F$16=\"\",\"Point 4\",\"Point 4 (SRR)\")","v":"Point 4"},null,null,null,null,null,{"$f":"IF(SynthèseContrôle!$F$17=\"\",\"Point 5\",\"Point 5 (SRR)\")","v":"Point 5"},null,null,null,null,null,{"$f":"IF(SynthèseContrôle!$F$18=\"\",\"Point 6\",\"Point 6 (SRR)\")","v":"Point 6"}]
[null,"Concentration\nen mg/l ","Etablissement","COFRAC","Labo\n de contrôle","COFRAC","Ecart (%)","Conformité","Etablissement","COFRAC","Labo\n de contrôle","COFRAC","Ecart (%)","Conformité","Etablissement","COFRAC","Labo\n de contrôle","COFRAC","Ecart (%)","Conformité"]
[null,"DBO5",null,null,null,null,{"$f":"IF(OR(E58=\"\",C58=\"\"),\"\",IF(ISERROR(VLOOKUP($B58,'SeuilsComparaison-EMT'!$C$5:$J$24,4,FALSE)),\"-\",IF(OR(IF(ISTEXT(E58)=TRUE,SUBSTITUTE(E58,\"<\",\"\",1)*1,E58)>VLOOKUP($B58,'SeuilsComparaison-EMT'!$C$5:$J$24,4,FALSE),IF(ISTEXT(C58)=TRUE,SUBSTITUTE(C58,\"<\",\"\",1)*1,C58)>VLOOKUP($B58,'SeuilsComparaison-EMT'!$C$5:$J$24,4,FALSE)=TRUE),(IF(ISTEXT(C58)=TRUE,SUBSTITUTE(C58,\"<\",\"\",1)*1,C58)-((IF(ISTEXT(C58)=TRUE,SUBSTITUTE(C58,\"<\",\"\",1)*1,C58)+IF(ISTEXT(E58)=TRUE,SUBSTITUTE(E58,\"<\",\"\",1)*1,E58))/2))/((IF(ISTEXT(C58)=TRUE,SUBSTITUTE(C58,\"<\",\"\",1)*1,C58)+IF(ISTEXT(E58)=TRUE,SUBSTITUTE(E58,\"<\",\"\",1),E58))/2),\"-\")))","v":""},{"$f":"IF(OR(E58=\"\",C58=\"\"),\"\",IF(AND(D58=\"Oui\",F58=\"Oui\"),\"Oui\",IF(G58=\"-\",\"Oui\",IF(OR(E58>VLOOKUP($B58,'SeuilsComparaison-EMT'!$C$5:$J$24,4,FALSE),C58>VLOOKUP($B58,'SeuilsComparaison-EMT'!$C$5:$J$24,4,FALSE)=TRUE),IF(C58<=VLOOKUP($B58,'SeuilsComparaison-EMT'!$C$5:$J$24,5,FALSE),IF(ABS(G58)<=VLOOKUP($B58,'SeuilsComparaison-EMT'!$C$5:$J$24,6,FALSE),\"Oui\",\"Non\"),IF(ABS(G58)<=VLOOKUP($B58,'SeuilsComparaison-EMT'!$C$5:$J$24,8,FALSE),\"Oui\",\"Non\")),\"Oui\"))))","v":""},null,null,null,null,{"$f":"IF(OR(K58=\"\",I58=\"\"),\"\",IF(ISERROR(VLOOKUP($B58,'SeuilsComparaison-EMT'!$C$5:$J$24,4,FALSE)),\"-\",IF(OR(IF(ISTEXT(K58)=TRUE,SUBSTITUTE(K58,\"<\",\"\",1)*1,K58)>VLOOKUP($B58,'SeuilsComparaison-EMT'!$C$5:$J$24,4,FALSE),IF(ISTEXT(I58)=TRUE,SUBSTITUTE(I58,\"<\",\"\",1)*1,I58)>VLOOKUP($B58,'SeuilsComparaison-EMT'!$C$5:$J$24,4,FALSE)=TRUE),(IF(ISTEXT(I58)=TRUE,SUBSTITUTE(I58,\"<\",\"\",1)*1,I58)-((IF(ISTEXT(I58)=TRUE,SUBSTITUTE(I58,\"<\",\"\",1)*1,I58)+IF(ISTEXT(K58)=TRUE,SUBSTITUTE(K58,\"<\",\"\",1)*1,K58))/2))/((IF(ISTEXT(I58)=TRUE,SUBSTITUTE(I58,\"<\",\"\",1)*1,I58)+IF(ISTEXT(K58)=TRUE,SUBSTITUTE(K58,\"<\",\"\",1),K58))/2),\"-\")))","v":""},{"$f":"IF(OR(K58=\"\",I58=\"\"),\"\",IF(AND(J58=\"Oui\",L58=\"Oui\"),\"Oui\",IF(M58=\"-\",\"Oui\",IF(OR(K58>VLOOKUP($B58,'SeuilsComparaison-EMT'!$C$5:$J$24,4,FALSE),I58>VLOOKUP($B58,'SeuilsComparaison-EMT'!$C$5:$J$24,4,FALSE)=TRUE),IF(I58<=VLOOKUP($B58,'SeuilsComparaison-EMT'!$C$5:$J$24,5,FALSE),IF(ABS(M58)<=VLOOKUP($B58,'SeuilsComparaison-EMT'!$C$5:$J$24,6,FALSE),\"Oui\",\"Non\"),IF(ABS(M58)<=VLOOKUP($B58,'SeuilsComparaison-EMT'!$C$5:$J$24,8,FALSE),\"Oui\",\"Non\")),\"Oui\"))))","v":""},null,null,null,null,{"$f":"IF(OR(Q58=\"\",O58=\"\"),\"\",IF(ISERROR(VLOOKUP($B58,'SeuilsComparaison-EMT'!$C$5:$J$24,4,FALSE)),\"-\",IF(OR(IF(ISTEXT(Q58)=TRUE,SUBSTITUTE(Q58,\"<\",\"\",1)*1,Q58)>VLOOKUP($B58,'SeuilsComparaison-EMT'!$C$5:$J$24,4,FALSE),IF(ISTEXT(O58)=TRUE,SUBSTITUTE(O58,\"<\",\"\",1)*1,O58)>VLOOKUP($B58,'SeuilsComparaison-EMT'!$C$5:$J$24,4,FALSE)=TRUE),(IF(ISTEXT(O58)=TRUE,SUBSTITUTE(O58,\"<\",\"\",1)*1,O58)-((IF(ISTEXT(O58)=TRUE,SUBSTITUTE(O58,\"<\",\"\",1)*1,O58)+IF(ISTEXT(Q58)=TRUE,SUBSTITUTE(Q58,\"<\",\"\",1)*1,Q58))/2))/((IF(ISTEXT(O58)=TRUE,SUBSTITUTE(O58,\"<\",\"\",1)*1,O58)+IF(ISTEXT(Q58)=TRUE,SUBSTITUTE(Q58,\"<\",\"\",1),Q58))/2),\"-\")))","v":""},{"$f":"IF(OR(Q58=\"\",O58=\"\"),\"\",IF(AND(P58=\"Oui\",R58=\"Oui\"),\"Oui\",IF(S58=\"-\",\"Oui\",IF(OR(Q58>VLOOKUP($B58,'SeuilsComparaison-EMT'!$C$5:$J$24,4,FALSE),O58>VLOOKUP($B58,'SeuilsComparaison-EMT'!$C$5:$J$24,4,FALSE)=TRUE),IF(O58<=VLOOKUP($B58,'SeuilsComparaison-EMT'!$C$5:$J$24,5,FALSE),IF(ABS(S58)<=VLOOKUP($B58,'SeuilsComparaison-EMT'!$C$5:$J$24,6,FALSE),\"Oui\",\"Non\"),IF(ABS(S58)<=VLOOKUP($B58,'SeuilsComparaison-EMT'!$C$5:$J$24,8,FALSE),\"Oui\",\"Non\")),\"Oui\"))))","v":""}]
[null,"DCO",null,null,null,null,{"$f":"IF(OR(E59=\"\",C59=\"\"),\"\",IF(ISERROR(VLOOKUP($B59,'SeuilsComparaison-EMT'!$C$5:$J$24,4,FALSE)),\"-\",IF(OR(IF(ISTEXT(E59)=TRUE,SUBSTITUTE(E59,\"<\",\"\",1)*1,E59)>VLOOKUP($B59,'SeuilsComparaison-EMT'!$C$5:$J$24,4,FALSE),IF(ISTEXT(C59)=TRUE,SUBSTITUTE(C59,\"<\",\"\",1)*1,C59)>VLOOKUP($B59,'SeuilsComparaison-EMT'!$C$5:$J$24,4,FALSE)=TRUE),(IF(ISTEXT(C59)=TRUE,SUBSTITUTE(C59,\"<\",\"\",1)*1,C59)-((IF(ISTEXT(C59)=TRUE,SUBSTITUTE(C59,\"<\",\"\",1)*1,C59)+IF(ISTEXT(E59)=TRUE,SUBSTITUTE(E59,\"<\",\"\",1)*1,E59))/2))/((IF(ISTEXT(C59)=TRUE,SUBSTITUTE(C59,\"<\",\"\",1)*1,C59)+IF(ISTEXT(E59)=TRUE,SUBSTITUTE(E59,\"<\",\"\",1),E59))/2),\"-\")))","v":""},{"$f":"IF(OR(E59=\"\",C59=\"\"),\"\",IF(AND(D59=\"Oui\",F59=\"Oui\"),\"Oui\",IF(G59=\"-\",\"Oui\",IF(OR(E59>VLOOKUP($B59,'SeuilsComparaison-EMT'!$C$5:$J$24,4,FALSE),C59>VLOOKUP($B59,'SeuilsComparaison-EMT'!$C$5:$J$24,4,FALSE)=TRUE),IF(C59<=VLOOKUP($B59,'SeuilsComparaison-EMT'!$C$5:$J$24,5,FALSE),IF(ABS(G59)<=VLOOKUP($B59,'SeuilsComparaison-EMT'!$C$5:$J$24,6,FALSE),\"Oui\",\"Non\"),IF(ABS(G59)<=VLOOKUP($B59,'SeuilsComparaison-EMT'!$C$5:$J$24,8,FALSE),\"Oui\",\"Non\")),\"Oui\"))))","v":""},null,null,null,null,{"$f":"IF(OR(K59=\"\",I59=\"\"),\"\",IF(ISERROR(VLOOKUP($B59,'SeuilsComparaison-EMT'!$C$5:$J$24,4,FALSE)),\"-\",IF(OR(IF(ISTEXT(K59)=TRUE,SUBSTITUTE(K59,\"<\",\"\",1)*1,K59)>VLOOKUP($B59,'SeuilsComparaison-EMT'!$C$5:$J$24,4,FALSE),IF(ISTEXT(I59)=TRUE,SUBSTITUTE(I59,\"<\",\"\",1)*1,I59)>VLOOKUP($B59,'SeuilsComparaison-EMT'!$C$5:$J$24,4,FALSE)=TRUE),(IF(ISTEXT(I59)=TRUE,SUBSTITUTE(I59,\"<\",\"\",1)*1,I59)-((IF(ISTEXT(I59)=TRUE,SUBSTITUTE(I59,\"<\",\"\",1)*1,I59)+IF(ISTEXT(K59)=TRUE,SUBSTITUTE(K59,\"<\",\"\",1)*1,K59))/2))/((IF(ISTEXT(I59)=TRUE,SUBSTITUTE(I59,\"<\",\"\",1)*1,I59)+IF(ISTEXT(K59)=TRUE,SUBSTITUTE(K59,\"<\",\"\",1),K59))/2),\"-\")))","v":""},{"$f":"IF(OR(K59=\"\",I59=\"\"),\"\",IF(AND(J59=\"Oui\",L59=\"Oui\"),\"Oui\",IF(M59=\"-\",\"Oui\",IF(OR(K59>VLOOKUP($B59,'SeuilsComparaison-EMT'!$C$5:$J$24,4,FALSE),I59>VLOOKUP($B59,'SeuilsComparaison-EMT'!$C$5:$J$24,4,FALSE)=TRUE),IF(I59<=VLOOKUP($B59,'SeuilsComparaison-EMT'!$C$5:$J$24,5,FALSE),IF(ABS(M59)<=VLOOKUP($B59,'SeuilsComparaison-EMT'!$C$5:$J$24,6,FALSE),\"Oui\",\"Non\"),IF(ABS(M59)<=VLOOKUP($B59,'SeuilsComparaison-EMT'!$C$5:$J$24,8,FALSE),\"Oui\",\"Non\")),\"Oui\"))))","v":""},null,null,null,null,{"$f":"IF(OR(Q59=\"\",O59=\"\"),\"\",IF(ISERROR(VLOOKUP($B59,'SeuilsComparaison-EMT'!$C$5:$J$24,4,FALSE)),\"-\",IF(OR(IF(ISTEXT(Q59)=TRUE,SUBSTITUTE(Q59,\"<\",\"\",1)*1,Q59)>VLOOKUP($B59,'SeuilsComparaison-EMT'!$C$5:$J$24,4,FALSE),IF(ISTEXT(O59)=TRUE,SUBSTITUTE(O59,\"<\",\"\",1)*1,O59)>VLOOKUP($B59,'SeuilsComparaison-EMT'!$C$5:$J$24,4,FALSE)=TRUE),(IF(ISTEXT(O59)=TRUE,SUBSTITUTE(O59,\"<\",\"\",1)*1,O59)-((IF(ISTEXT(O59)=TRUE,SUBSTITUTE(O59,\"<\",\"\",1)*1,O59)+IF(ISTEXT(Q59)=TRUE,SUBSTITUTE(Q59,\"<\",\"\",1)*1,Q59))/2))/((IF(ISTEXT(O59)=TRUE,SUBSTITUTE(O59,\"<\",\"\",1)*1,O59)+IF(ISTEXT(Q59)=TRUE,SUBSTITUTE(Q59,\"<\",\"\",1),Q59))/2),\"-\")))","v":""},{"$f":"IF(OR(Q59=\"\",O59=\"\"),\"\",IF(AND(P59=\"Oui\",R59=\"Oui\"),\"Oui\",IF(S59=\"-\",\"Oui\",IF(OR(Q59>VLOOKUP($B59,'SeuilsComparaison-EMT'!$C$5:$J$24,4,FALSE),O59>VLOOKUP($B59,'SeuilsComparaison-EMT'!$C$5:$J$24,4,FALSE)=TRUE),IF(O59<=VLOOKUP($B59,'SeuilsComparaison-EMT'!$C$5:$J$24,5,FALSE),IF(ABS(S59)<=VLOOKUP($B59,'SeuilsComparaison-EMT'!$C$5:$J$24,6,FALSE),\"Oui\",\"Non\"),IF(ABS(S59)<=VLOOKUP($B59,'SeuilsComparaison-EMT'!$C$5:$J$24,8,FALSE),\"Oui\",\"Non\")),\"Oui\"))))","v":""}]
[null,"ST DCO",null,null,null,null,{"$f":"IF(OR(E60=\"\",C60=\"\"),\"\",IF(ISERROR(VLOOKUP($B60,'SeuilsComparaison-EMT'!$C$5:$J$24,4,FALSE)),\"-\",IF(OR(IF(ISTEXT(E60)=TRUE,SUBSTITUTE(E60,\"<\",\"\",1)*1,E60)>VLOOKUP($B60,'SeuilsComparaison-EMT'!$C$5:$J$24,4,FALSE),IF(ISTEXT(C60)=TRUE,SUBSTITUTE(C60,\"<\",\"\",1)*1,C60)>VLOOKUP($B60,'SeuilsComparaison-EMT'!$C$5:$J$24,4,FALSE)=TRUE),(IF(ISTEXT(C60)=TRUE,SUBSTITUTE(C60,\"<\",\"\",1)*1,C60)-((IF(ISTEXT(C60)=TRUE,SUBSTITUTE(C60,\"<\",\"\",1)*1,C60)+IF(ISTEXT(E60)=TRUE,SUBSTITUTE(E60,\"<\",\"\",1)*1,E60))/2))/((IF(ISTEXT(C60)=TRUE,SUBSTITUTE(C60,\"<\",\"\",1)*1,C60)+IF(ISTEXT(E60)=TRUE,SUBSTITUTE(E60,\"<\",\"\",1),E60))/2),\"-\")))","v":""},{"$f":"IF(OR(E60=\"\",C60=\"\"),\"\",IF(AND(D60=\"Oui\",F60=\"Oui\"),\"Oui\",IF(G60=\"-\",\"Oui\",IF(OR(E60>VLOOKUP($B60,'SeuilsComparaison-EMT'!$C$5:$J$24,4,FALSE),C60>VLOOKUP($B60,'SeuilsComparaison-EMT'!$C$5:$J$24,4,FALSE)=TRUE),IF(C60<=VLOOKUP($B60,'SeuilsComparaison-EMT'!$C$5:$J$24,5,FALSE),IF(ABS(G60)<=VLOOKUP($B60,'SeuilsComparaison-EMT'!$C$5:$J$24,6,FALSE),\"Oui\",\"Non\"),IF(ABS(G60)<=VLOOKUP($B60,'SeuilsComparaison-EMT'!$C$5:$J$24,8,FALSE),\"Oui\",\"Non\")),\"Oui\"))))","v":""},null,null,null,null,{"$f":"IF(OR(K60=\"\",I60=\"\"),\"\",IF(ISERROR(VLOOKUP($B60,'SeuilsComparaison-EMT'!$C$5:$J$24,4,FALSE)),\"-\",IF(OR(IF(ISTEXT(K60)=TRUE,SUBSTITUTE(K60,\"<\",\"\",1)*1,K60)>VLOOKUP($B60,'SeuilsComparaison-EMT'!$C$5:$J$24,4,FALSE),IF(ISTEXT(I60)=TRUE,SUBSTITUTE(I60,\"<\",\"\",1)*1,I60)>VLOOKUP($B60,'SeuilsComparaison-EMT'!$C$5:$J$24,4,FALSE)=TRUE),(IF(ISTEXT(I60)=TRUE,SUBSTITUTE(I60,\"<\",\"\",1)*1,I60)-((IF(ISTEXT(I60)=TRUE,SUBSTITUTE(I60,\"<\",\"\",1)*1,I60)+IF(ISTEXT(K60)=TRUE,SUBSTITUTE(K60,\"<\",\"\",1)*1,K60))/2))/((IF(ISTEXT(I60)=TRUE,SUBSTITUTE(I60,\"<\",\"\",1)*1,I60)+IF(ISTEXT(K60)=TRUE,SUBSTITUTE(K60,\"<\",\"\",1),K60))/2),\"-\")))","v":""},{"$f":"IF(OR(K60=\"\",I60=\"\"),\"\",IF(AND(J60=\"Oui\",L60=\"Oui\"),\"Oui\",IF(M60=\"-\",\"Oui\",IF(OR(K60>VLOOKUP($B60,'SeuilsComparaison-EMT'!$C$5:$J$24,4,FALSE),I60>VLOOKUP($B60,'SeuilsComparaison-EMT'!$C$5:$J$24,4,FALSE)=TRUE),IF(I60<=VLOOKUP($B60,'SeuilsComparaison-EMT'!$C$5:$J$24,5,FALSE),IF(ABS(M60)<=VLOOKUP($B60,'SeuilsComparaison-EMT'!$C$5:$J$24,6,FALSE),\"Oui\",\"Non\"),IF(ABS(M60)<=VLOOKUP($B60,'SeuilsComparaison-EMT'!$C$5:$J$24,8,FALSE),\"Oui\",\"Non\")),\"Oui\"))))","v":""},null,null,null,null,{"$f":"IF(OR(Q60=\"\",O60=\"\"),\"\",IF(ISERROR(VLOOKUP($B60,'SeuilsComparaison-EMT'!$C$5:$J$24,4,FALSE)),\"-\",IF(OR(IF(ISTEXT(Q60)=TRUE,SUBSTITUTE(Q60,\"<\",\"\",1)*1,Q60)>VLOOKUP($B60,'SeuilsComparaison-EMT'!$C$5:$J$24,4,FALSE),IF(ISTEXT(O60)=TRUE,SUBSTITUTE(O60,\"<\",\"\",1)*1,O60)>VLOOKUP($B60,'SeuilsComparaison-EMT'!$C$5:$J$24,4,FALSE)=TRUE),(IF(ISTEXT(O60)=TRUE,SUBSTITUTE(O60,\"<\",\"\",1)*1,O60)-((IF(ISTEXT(O60)=TRUE,SUBSTITUTE(O60,\"<\",\"\",1)*1,O60)+IF(ISTEXT(Q60)=TRUE,SUBSTITUTE(Q60,\"<\",\"\",1)*1,Q60))/2))/((IF(ISTEXT(O60)=TRUE,SUBSTITUTE(O60,\"<\",\"\",1)*1,O60)+IF(ISTEXT(Q60)=TRUE,SUBSTITUTE(Q60,\"<\",\"\",1),Q60))/2),\"-\")))","v":""},{"$f":"IF(OR(Q60=\"\",O60=\"\"),\"\",IF(AND(P60=\"Oui\",R60=\"Oui\"),\"Oui\",IF(S60=\"-\",\"Oui\",IF(OR(Q60>VLOOKUP($B60,'SeuilsComparaison-EMT'!$C$5:$J$24,4,FALSE),O60>VLOOKUP($B60,'SeuilsComparaison-EMT'!$C$5:$J$24,4,FALSE)=TRUE),IF(O60<=VLOOKUP($B60,'SeuilsComparaison-EMT'!$C$5:$J$24,5,FALSE),IF(ABS(S60)<=VLOOKUP($B60,'SeuilsComparaison-EMT'!$C$5:$J$24,6,FALSE),\"Oui\",\"Non\"),IF(ABS(S60)<=VLOOKUP($B60,'SeuilsComparaison-EMT'!$C$5:$J$24,8,FALSE),\"Oui\",\"Non\")),\"Oui\"))))","v":""}]
[null,"COT",null,null,null,null,{"$f":"IF(OR(E61=\"\",C61=\"\"),\"\",IF(ISERROR(VLOOKUP($B61,'SeuilsComparaison-EMT'!$C$5:$J$24,4,FALSE)),\"-\",IF(OR(IF(ISTEXT(E61)=TRUE,SUBSTITUTE(E61,\"<\",\"\",1)*1,E61)>VLOOKUP($B61,'SeuilsComparaison-EMT'!$C$5:$J$24,4,FALSE),IF(ISTEXT(C61)=TRUE,SUBSTITUTE(C61,\"<\",\"\",1)*1,C61)>VLOOKUP($B61,'SeuilsComparaison-EMT'!$C$5:$J$24,4,FALSE)=TRUE),(IF(ISTEXT(C61)=TRUE,SUBSTITUTE(C61,\"<\",\"\",1)*1,C61)-((IF(ISTEXT(C61)=TRUE,SUBSTITUTE(C61,\"<\",\"\",1)*1,C61)+IF(ISTEXT(E61)=TRUE,SUBSTITUTE(E61,\"<\",\"\",1)*1,E61))/2))/((IF(ISTEXT(C61)=TRUE,SUBSTITUTE(C61,\"<\",\"\",1)*1,C61)+IF(ISTEXT(E61)=TRUE,SUBSTITUTE(E61,\"<\",\"\",1),E61))/2),\"-\")))","v":""},{"$f":"IF(OR(E61=\"\",C61=\"\"),\"\",IF(AND(D61=\"Oui\",F61=\"Oui\"),\"Oui\",IF(G61=\"-\",\"Oui\",IF(OR(E61>VLOOKUP($B61,'SeuilsComparaison-EMT'!$C$5:$J$24,4,FALSE),C61>VLOOKUP($B61,'SeuilsComparaison-EMT'!$C$5:$J$24,4,FALSE)=TRUE),IF(C61<=VLOOKUP($B61,'SeuilsComparaison-EMT'!$C$5:$J$24,5,FALSE),IF(ABS(G61)<=VLOOKUP($B61,'SeuilsComparaison-EMT'!$C$5:$J$24,6,FALSE),\"Oui\",\"Non\"),IF(ABS(G61)<=VLOOKUP($B61,'SeuilsComparaison-EMT'!$C$5:$J$24,8,FALSE),\"Oui\",\"Non\")),\"Oui\"))))","v":""},null,null,null,null,{"$f":"IF(OR(K61=\"\",I61=\"\"),\"\",IF(ISERROR(VLOOKUP($B61,'SeuilsComparaison-EMT'!$C$5:$J$24,4,FALSE)),\"-\",IF(OR(IF(ISTEXT(K61)=TRUE,SUBSTITUTE(K61,\"<\",\"\",1)*1,K61)>VLOOKUP($B61,'SeuilsComparaison-EMT'!$C$5:$J$24,4,FALSE),IF(ISTEXT(I61)=TRUE,SUBSTITUTE(I61,\"<\",\"\",1)*1,I61)>VLOOKUP($B61,'SeuilsComparaison-EMT'!$C$5:$J$24,4,FALSE)=TRUE),(IF(ISTEXT(I61)=TRUE,SUBSTITUTE(I61,\"<\",\"\",1)*1,I61)-((IF(ISTEXT(I61)=TRUE,SUBSTITUTE(I61,\"<\",\"\",1)*1,I61)+IF(ISTEXT(K61)=TRUE,SUBSTITUTE(K61,\"<\",\"\",1)*1,K61))/2))/((IF(ISTEXT(I61)=TRUE,SUBSTITUTE(I61,\"<\",\"\",1)*1,I61)+IF(ISTEXT(K61)=TRUE,SUBSTITUTE(K61,\"<\",\"\",1),K61))/2),\"-\")))","v":""},{"$f":"IF(OR(K61=\"\",I61=\"\"),\"\",IF(AND(J61=\"Oui\",L61=\"Oui\"),\"Oui\",IF(M61=\"-\",\"Oui\",IF(OR(K61>VLOOKUP($B61,'SeuilsComparaison-EMT'!$C$5:$J$24,4,FALSE),I61>VLOOKUP($B61,'SeuilsComparaison-EMT'!$C$5:$J$24,4,FALSE)=TRUE),IF(I61<=VLOOKUP($B61,'SeuilsComparaison-EMT'!$C$5:$J$24,5,FALSE),IF(ABS(M61)<=VLOOKUP($B61,'SeuilsComparaison-EMT'!$C$5:$J$24,6,FALSE),\"Oui\",\"Non\"),IF(ABS(M61)<=VLOOKUP($B61,'SeuilsComparaison-EMT'!$C$5:$J$24,8,FALSE),\"Oui\",\"Non\")),\"Oui\"))))","v":""},null,null,null,null,{"$f":"IF(OR(Q61=\"\",O61=\"\"),\"\",IF(ISERROR(VLOOKUP($B61,'SeuilsComparaison-EMT'!$C$5:$J$24,4,FALSE)),\"-\",IF(OR(IF(ISTEXT(Q61)=TRUE,SUBSTITUTE(Q61,\"<\",\"\",1)*1,Q61)>VLOOKUP($B61,'SeuilsComparaison-EMT'!$C$5:$J$24,4,FALSE),IF(ISTEXT(O61)=TRUE,SUBSTITUTE(O61,\"<\",\"\",1)*1,O61)>VLOOKUP($B61,'SeuilsComparaison-EMT'!$C$5:$J$24,4,FALSE)=TRUE),(IF(ISTEXT(O61)=TRUE,SUBSTITUTE(O61,\"<\",\"\",1)*1,O61)-((IF(ISTEXT(O61)=TRUE,SUBSTITUTE(O61,\"<\",\"\",1)*1,O61)+IF(ISTEXT(Q61)=TRUE,SUBSTITUTE(Q61,\"<\",\"\",1)*1,Q61))/2))/((IF(ISTEXT(O61)=TRUE,SUBSTITUTE(O61,\"<\",\"\",1)*1,O61)+IF(ISTEXT(Q61)=TRUE,SUBSTITUTE(Q61,\"<\",\"\",1),Q61))/2),\"-\")))","v":""},{"$f":"IF(OR(Q61=\"\",O61=\"\"),\"\",IF(AND(P61=\"Oui\",R61=\"Oui\"),\"Oui\",IF(S61=\"-\",\"Oui\",IF(OR(Q61>VLOOKUP($B61,'SeuilsComparaison-EMT'!$C$5:$J$24,4,FALSE),O61>VLOOKUP($B61,'SeuilsComparaison-EMT'!$C$5:$J$24,4,FALSE)=TRUE),IF(O61<=VLOOKUP($B61,'SeuilsComparaison-EMT'!$C$5:$J$24,5,FALSE),IF(ABS(S61)<=VLOOKUP($B61,'SeuilsComparaison-EMT'!$C$5:$J$24,6,FALSE),\"Oui\",\"Non\"),IF(ABS(S61)<=VLOOKUP($B61,'SeuilsComparaison-EMT'!$C$5:$J$24,8,FALSE),\"Oui\",\"Non\")),\"Oui\"))))","v":""}]
[null,"MEST",null,null,null,null,{"$f":"IF(OR(E62=\"\",C62=\"\"),\"\",IF(ISERROR(VLOOKUP($B62,'SeuilsComparaison-EMT'!$C$5:$J$24,4,FALSE)),\"-\",IF(OR(IF(ISTEXT(E62)=TRUE,SUBSTITUTE(E62,\"<\",\"\",1)*1,E62)>VLOOKUP($B62,'SeuilsComparaison-EMT'!$C$5:$J$24,4,FALSE),IF(ISTEXT(C62)=TRUE,SUBSTITUTE(C62,\"<\",\"\",1)*1,C62)>VLOOKUP($B62,'SeuilsComparaison-EMT'!$C$5:$J$24,4,FALSE)=TRUE),(IF(ISTEXT(C62)=TRUE,SUBSTITUTE(C62,\"<\",\"\",1)*1,C62)-((IF(ISTEXT(C62)=TRUE,SUBSTITUTE(C62,\"<\",\"\",1)*1,C62)+IF(ISTEXT(E62)=TRUE,SUBSTITUTE(E62,\"<\",\"\",1)*1,E62))/2))/((IF(ISTEXT(C62)=TRUE,SUBSTITUTE(C62,\"<\",\"\",1)*1,C62)+IF(ISTEXT(E62)=TRUE,SUBSTITUTE(E62,\"<\",\"\",1),E62))/2),\"-\")))","v":""},{"$f":"IF(OR(E62=\"\",C62=\"\"),\"\",IF(AND(D62=\"Oui\",F62=\"Oui\"),\"Oui\",IF(G62=\"-\",\"Oui\",IF(OR(E62>VLOOKUP($B62,'SeuilsComparaison-EMT'!$C$5:$J$24,4,FALSE),C62>VLOOKUP($B62,'SeuilsComparaison-EMT'!$C$5:$J$24,4,FALSE)=TRUE),IF(C62<=VLOOKUP($B62,'SeuilsComparaison-EMT'!$C$5:$J$24,5,FALSE),IF(ABS(G62)<=VLOOKUP($B62,'SeuilsComparaison-EMT'!$C$5:$J$24,6,FALSE),\"Oui\",\"Non\"),IF(ABS(G62)<=VLOOKUP($B62,'SeuilsComparaison-EMT'!$C$5:$J$24,8,FALSE),\"Oui\",\"Non\")),\"Oui\"))))","v":""},null,null,null,null,{"$f":"IF(OR(K62=\"\",I62=\"\"),\"\",IF(ISERROR(VLOOKUP($B62,'SeuilsComparaison-EMT'!$C$5:$J$24,4,FALSE)),\"-\",IF(OR(IF(ISTEXT(K62)=TRUE,SUBSTITUTE(K62,\"<\",\"\",1)*1,K62)>VLOOKUP($B62,'SeuilsComparaison-EMT'!$C$5:$J$24,4,FALSE),IF(ISTEXT(I62)=TRUE,SUBSTITUTE(I62,\"<\",\"\",1)*1,I62)>VLOOKUP($B62,'SeuilsComparaison-EMT'!$C$5:$J$24,4,FALSE)=TRUE),(IF(ISTEXT(I62)=TRUE,SUBSTITUTE(I62,\"<\",\"\",1)*1,I62)-((IF(ISTEXT(I62)=TRUE,SUBSTITUTE(I62,\"<\",\"\",1)*1,I62)+IF(ISTEXT(K62)=TRUE,SUBSTITUTE(K62,\"<\",\"\",1)*1,K62))/2))/((IF(ISTEXT(I62)=TRUE,SUBSTITUTE(I62,\"<\",\"\",1)*1,I62)+IF(ISTEXT(K62)=TRUE,SUBSTITUTE(K62,\"<\",\"\",1),K62))/2),\"-\")))","v":""},{"$f":"IF(OR(K62=\"\",I62=\"\"),\"\",IF(AND(J62=\"Oui\",L62=\"Oui\"),\"Oui\",IF(M62=\"-\",\"Oui\",IF(OR(K62>VLOOKUP($B62,'SeuilsComparaison-EMT'!$C$5:$J$24,4,FALSE),I62>VLOOKUP($B62,'SeuilsComparaison-EMT'!$C$5:$J$24,4,FALSE)=TRUE),IF(I62<=VLOOKUP($B62,'SeuilsComparaison-EMT'!$C$5:$J$24,5,FALSE),IF(ABS(M62)<=VLOOKUP($B62,'SeuilsComparaison-EMT'!$C$5:$J$24,6,FALSE),\"Oui\",\"Non\"),IF(ABS(M62)<=VLOOKUP($B62,'SeuilsComparaison-EMT'!$C$5:$J$24,8,FALSE),\"Oui\",\"Non\")),\"Oui\"))))","v":""},null,null,null,null,{"$f":"IF(OR(Q62=\"\",O62=\"\"),\"\",IF(ISERROR(VLOOKUP($B62,'SeuilsComparaison-EMT'!$C$5:$J$24,4,FALSE)),\"-\",IF(OR(IF(ISTEXT(Q62)=TRUE,SUBSTITUTE(Q62,\"<\",\"\",1)*1,Q62)>VLOOKUP($B62,'SeuilsComparaison-EMT'!$C$5:$J$24,4,FALSE),IF(ISTEXT(O62)=TRUE,SUBSTITUTE(O62,\"<\",\"\",1)*1,O62)>VLOOKUP($B62,'SeuilsComparaison-EMT'!$C$5:$J$24,4,FALSE)=TRUE),(IF(ISTEXT(O62)=TRUE,SUBSTITUTE(O62,\"<\",\"\",1)*1,O62)-((IF(ISTEXT(O62)=TRUE,SUBSTITUTE(O62,\"<\",\"\",1)*1,O62)+IF(ISTEXT(Q62)=TRUE,SUBSTITUTE(Q62,\"<\",\"\",1)*1,Q62))/2))/((IF(ISTEXT(O62)=TRUE,SUBSTITUTE(O62,\"<\",\"\",1)*1,O62)+IF(ISTEXT(Q62)=TRUE,SUBSTITUTE(Q62,\"<\",\"\",1),Q62))/2),\"-\")))","v":""},{"$f":"IF(OR(Q62=\"\",O62=\"\"),\"\",IF(AND(P62=\"Oui\",R62=\"Oui\"),\"Oui\",IF(S62=\"-\",\"Oui\",IF(OR(Q62>VLOOKUP($B62,'SeuilsComparaison-EMT'!$C$5:$J$24,4,FALSE),O62>VLOOKUP($B62,'SeuilsComparaison-EMT'!$C$5:$J$24,4,FALSE)=TRUE),IF(O62<=VLOOKUP($B62,'SeuilsComparaison-EMT'!$C$5:$J$24,5,FALSE),IF(ABS(S62)<=VLOOKUP($B62,'SeuilsComparaison-EMT'!$C$5:$J$24,6,FALSE),\"Oui\",\"Non\"),IF(ABS(S62)<=VLOOKUP($B62,'SeuilsComparaison-EMT'!$C$5:$J$24,8,FALSE),\"Oui\",\"Non\")),\"Oui\"))))","v":""}]
[null,"NKJ (N)",null,null,null,null,{"$f":"IF(OR(E63=\"\",C63=\"\"),\"\",IF(ISERROR(VLOOKUP($B63,'SeuilsComparaison-EMT'!$C$5:$J$24,4,FALSE)),\"-\",IF(OR(IF(ISTEXT(E63)=TRUE,SUBSTITUTE(E63,\"<\",\"\",1)*1,E63)>VLOOKUP($B63,'SeuilsComparaison-EMT'!$C$5:$J$24,4,FALSE),IF(ISTEXT(C63)=TRUE,SUBSTITUTE(C63,\"<\",\"\",1)*1,C63)>VLOOKUP($B63,'SeuilsComparaison-EMT'!$C$5:$J$24,4,FALSE)=TRUE),(IF(ISTEXT(C63)=TRUE,SUBSTITUTE(C63,\"<\",\"\",1)*1,C63)-((IF(ISTEXT(C63)=TRUE,SUBSTITUTE(C63,\"<\",\"\",1)*1,C63)+IF(ISTEXT(E63)=TRUE,SUBSTITUTE(E63,\"<\",\"\",1)*1,E63))/2))/((IF(ISTEXT(C63)=TRUE,SUBSTITUTE(C63,\"<\",\"\",1)*1,C63)+IF(ISTEXT(E63)=TRUE,SUBSTITUTE(E63,\"<\",\"\",1),E63))/2),\"-\")))","v":""},{"$f":"IF(OR(E63=\"\",C63=\"\"),\"\",IF(AND(D63=\"Oui\",F63=\"Oui\"),\"Oui\",IF(G63=\"-\",\"Oui\",IF(OR(E63>VLOOKUP($B63,'SeuilsComparaison-EMT'!$C$5:$J$24,4,FALSE),C63>VLOOKUP($B63,'SeuilsComparaison-EMT'!$C$5:$J$24,4,FALSE)=TRUE),IF(C63<=VLOOKUP($B63,'SeuilsComparaison-EMT'!$C$5:$J$24,5,FALSE),IF(ABS(G63)<=VLOOKUP($B63,'SeuilsComparaison-EMT'!$C$5:$J$24,6,FALSE),\"Oui\",\"Non\"),IF(ABS(G63)<=VLOOKUP($B63,'SeuilsComparaison-EMT'!$C$5:$J$24,8,FALSE),\"Oui\",\"Non\")),\"Oui\"))))","v":""},null,null,null,null,{"$f":"IF(OR(K63=\"\",I63=\"\"),\"\",IF(ISERROR(VLOOKUP($B63,'SeuilsComparaison-EMT'!$C$5:$J$24,4,FALSE)),\"-\",IF(OR(IF(ISTEXT(K63)=TRUE,SUBSTITUTE(K63,\"<\",\"\",1)*1,K63)>VLOOKUP($B63,'SeuilsComparaison-EMT'!$C$5:$J$24,4,FALSE),IF(ISTEXT(I63)=TRUE,SUBSTITUTE(I63,\"<\",\"\",1)*1,I63)>VLOOKUP($B63,'SeuilsComparaison-EMT'!$C$5:$J$24,4,FALSE)=TRUE),(IF(ISTEXT(I63)=TRUE,SUBSTITUTE(I63,\"<\",\"\",1)*1,I63)-((IF(ISTEXT(I63)=TRUE,SUBSTITUTE(I63,\"<\",\"\",1)*1,I63)+IF(ISTEXT(K63)=TRUE,SUBSTITUTE(K63,\"<\",\"\",1)*1,K63))/2))/((IF(ISTEXT(I63)=TRUE,SUBSTITUTE(I63,\"<\",\"\",1)*1,I63)+IF(ISTEXT(K63)=TRUE,SUBSTITUTE(K63,\"<\",\"\",1),K63))/2),\"-\")))","v":""},{"$f":"IF(OR(K63=\"\",I63=\"\"),\"\",IF(AND(J63=\"Oui\",L63=\"Oui\"),\"Oui\",IF(M63=\"-\",\"Oui\",IF(OR(K63>VLOOKUP($B63,'SeuilsComparaison-EMT'!$C$5:$J$24,4,FALSE),I63>VLOOKUP($B63,'SeuilsComparaison-EMT'!$C$5:$J$24,4,FALSE)=TRUE),IF(I63<=VLOOKUP($B63,'SeuilsComparaison-EMT'!$C$5:$J$24,5,FALSE),IF(ABS(M63)<=VLOOKUP($B63,'SeuilsComparaison-EMT'!$C$5:$J$24,6,FALSE),\"Oui\",\"Non\"),IF(ABS(M63)<=VLOOKUP($B63,'SeuilsComparaison-EMT'!$C$5:$J$24,8,FALSE),\"Oui\",\"Non\")),\"Oui\"))))","v":""},null,null,null,null,{"$f":"IF(OR(Q63=\"\",O63=\"\"),\"\",IF(ISERROR(VLOOKUP($B63,'SeuilsComparaison-EMT'!$C$5:$J$24,4,FALSE)),\"-\",IF(OR(IF(ISTEXT(Q63)=TRUE,SUBSTITUTE(Q63,\"<\",\"\",1)*1,Q63)>VLOOKUP($B63,'SeuilsComparaison-EMT'!$C$5:$J$24,4,FALSE),IF(ISTEXT(O63)=TRUE,SUBSTITUTE(O63,\"<\",\"\",1)*1,O63)>VLOOKUP($B63,'SeuilsComparaison-EMT'!$C$5:$J$24,4,FALSE)=TRUE),(IF(ISTEXT(O63)=TRUE,SUBSTITUTE(O63,\"<\",\"\",1)*1,O63)-((IF(ISTEXT(O63)=TRUE,SUBSTITUTE(O63,\"<\",\"\",1)*1,O63)+IF(ISTEXT(Q63)=TRUE,SUBSTITUTE(Q63,\"<\",\"\",1)*1,Q63))/2))/((IF(ISTEXT(O63)=TRUE,SUBSTITUTE(O63,\"<\",\"\",1)*1,O63)+IF(ISTEXT(Q63)=TRUE,SUBSTITUTE(Q63,\"<\",\"\",1),Q63))/2),\"-\")))","v":""},{"$f":"IF(OR(Q63=\"\",O63=\"\"),\"\",IF(AND(P63=\"Oui\",R63=\"Oui\"),\"Oui\",IF(S63=\"-\",\"Oui\",IF(OR(Q63>VLOOKUP($B63,'SeuilsComparaison-EMT'!$C$5:$J$24,4,FALSE),O63>VLOOKUP($B63,'SeuilsComparaison-EMT'!$C$5:$J$24,4,FALSE)=TRUE),IF(O63<=VLOOKUP($B63,'SeuilsComparaison-EMT'!$C$5:$J$24,5,FALSE),IF(ABS(S63)<=VLOOKUP($B63,'SeuilsComparaison-EMT'!$C$5:$J$24,6,FALSE),\"Oui\",\"Non\"),IF(ABS(S63)<=VLOOKUP($B63,'SeuilsComparaison-EMT'!$C$5:$J$24,8,FALSE),\"Oui\",\"Non\")),\"Oui\"))))","v":""}]
[null,"NH4 (NH4)",null,null,null,null,{"$f":"IF(OR(E64=\"\",C64=\"\"),\"\",IF(ISERROR(VLOOKUP($B64,'SeuilsComparaison-EMT'!$C$5:$J$24,4,FALSE)),\"-\",IF(OR(IF(ISTEXT(E64)=TRUE,SUBSTITUTE(E64,\"<\",\"\",1)*1,E64)>VLOOKUP($B64,'SeuilsComparaison-EMT'!$C$5:$J$24,4,FALSE),IF(ISTEXT(C64)=TRUE,SUBSTITUTE(C64,\"<\",\"\",1)*1,C64)>VLOOKUP($B64,'SeuilsComparaison-EMT'!$C$5:$J$24,4,FALSE)=TRUE),(IF(ISTEXT(C64)=TRUE,SUBSTITUTE(C64,\"<\",\"\",1)*1,C64)-((IF(ISTEXT(C64)=TRUE,SUBSTITUTE(C64,\"<\",\"\",1)*1,C64)+IF(ISTEXT(E64)=TRUE,SUBSTITUTE(E64,\"<\",\"\",1)*1,E64))/2))/((IF(ISTEXT(C64)=TRUE,SUBSTITUTE(C64,\"<\",\"\",1)*1,C64)+IF(ISTEXT(E64)=TRUE,SUBSTITUTE(E64,\"<\",\"\",1),E64))/2),\"-\")))","v":""},{"$f":"IF(OR(E64=\"\",C64=\"\"),\"\",IF(AND(D64=\"Oui\",F64=\"Oui\"),\"Oui\",IF(G64=\"-\",\"Oui\",IF(OR(E64>VLOOKUP($B64,'SeuilsComparaison-EMT'!$C$5:$J$24,4,FALSE),C64>VLOOKUP($B64,'SeuilsComparaison-EMT'!$C$5:$J$24,4,FALSE)=TRUE),IF(C64<=VLOOKUP($B64,'SeuilsComparaison-EMT'!$C$5:$J$24,5,FALSE),IF(ABS(G64)<=VLOOKUP($B64,'SeuilsComparaison-EMT'!$C$5:$J$24,6,FALSE),\"Oui\",\"Non\"),IF(ABS(G64)<=VLOOKUP($B64,'SeuilsComparaison-EMT'!$C$5:$J$24,8,FALSE),\"Oui\",\"Non\")),\"Oui\"))))","v":""},null,null,null,null,{"$f":"IF(OR(K64=\"\",I64=\"\"),\"\",IF(ISERROR(VLOOKUP($B64,'SeuilsComparaison-EMT'!$C$5:$J$24,4,FALSE)),\"-\",IF(OR(IF(ISTEXT(K64)=TRUE,SUBSTITUTE(K64,\"<\",\"\",1)*1,K64)>VLOOKUP($B64,'SeuilsComparaison-EMT'!$C$5:$J$24,4,FALSE),IF(ISTEXT(I64)=TRUE,SUBSTITUTE(I64,\"<\",\"\",1)*1,I64)>VLOOKUP($B64,'SeuilsComparaison-EMT'!$C$5:$J$24,4,FALSE)=TRUE),(IF(ISTEXT(I64)=TRUE,SUBSTITUTE(I64,\"<\",\"\",1)*1,I64)-((IF(ISTEXT(I64)=TRUE,SUBSTITUTE(I64,\"<\",\"\",1)*1,I64)+IF(ISTEXT(K64)=TRUE,SUBSTITUTE(K64,\"<\",\"\",1)*1,K64))/2))/((IF(ISTEXT(I64)=TRUE,SUBSTITUTE(I64,\"<\",\"\",1)*1,I64)+IF(ISTEXT(K64)=TRUE,SUBSTITUTE(K64,\"<\",\"\",1),K64))/2),\"-\")))","v":""},{"$f":"IF(OR(K64=\"\",I64=\"\"),\"\",IF(AND(J64=\"Oui\",L64=\"Oui\"),\"Oui\",IF(M64=\"-\",\"Oui\",IF(OR(K64>VLOOKUP($B64,'SeuilsComparaison-EMT'!$C$5:$J$24,4,FALSE),I64>VLOOKUP($B64,'SeuilsComparaison-EMT'!$C$5:$J$24,4,FALSE)=TRUE),IF(I64<=VLOOKUP($B64,'SeuilsComparaison-EMT'!$C$5:$J$24,5,FALSE),IF(ABS(M64)<=VLOOKUP($B64,'SeuilsComparaison-EMT'!$C$5:$J$24,6,FALSE),\"Oui\",\"Non\"),IF(ABS(M64)<=VLOOKUP($B64,'SeuilsComparaison-EMT'!$C$5:$J$24,8,FALSE),\"Oui\",\"Non\")),\"Oui\"))))","v":""},null,null,null,null,{"$f":"IF(OR(Q64=\"\",O64=\"\"),\"\",IF(ISERROR(VLOOKUP($B64,'SeuilsComparaison-EMT'!$C$5:$J$24,4,FALSE)),\"-\",IF(OR(IF(ISTEXT(Q64)=TRUE,SUBSTITUTE(Q64,\"<\",\"\",1)*1,Q64)>VLOOKUP($B64,'SeuilsComparaison-EMT'!$C$5:$J$24,4,FALSE),IF(ISTEXT(O64)=TRUE,SUBSTITUTE(O64,\"<\",\"\",1)*1,O64)>VLOOKUP($B64,'SeuilsComparaison-EMT'!$C$5:$J$24,4,FALSE)=TRUE),(IF(ISTEXT(O64)=TRUE,SUBSTITUTE(O64,\"<\",\"\",1)*1,O64)-((IF(ISTEXT(O64)=TRUE,SUBSTITUTE(O64,\"<\",\"\",1)*1,O64)+IF(ISTEXT(Q64)=TRUE,SUBSTITUTE(Q64,\"<\",\"\",1)*1,Q64))/2))/((IF(ISTEXT(O64)=TRUE,SUBSTITUTE(O64,\"<\",\"\",1)*1,O64)+IF(ISTEXT(Q64)=TRUE,SUBSTITUTE(Q64,\"<\",\"\",1),Q64))/2),\"-\")))","v":""},{"$f":"IF(OR(Q64=\"\",O64=\"\"),\"\",IF(AND(P64=\"Oui\",R64=\"Oui\"),\"Oui\",IF(S64=\"-\",\"Oui\",IF(OR(Q64>VLOOKUP($B64,'SeuilsComparaison-EMT'!$C$5:$J$24,4,FALSE),O64>VLOOKUP($B64,'SeuilsComparaison-EMT'!$C$5:$J$24,4,FALSE)=TRUE),IF(O64<=VLOOKUP($B64,'SeuilsComparaison-EMT'!$C$5:$J$24,5,FALSE),IF(ABS(S64)<=VLOOKUP($B64,'SeuilsComparaison-EMT'!$C$5:$J$24,6,FALSE),\"Oui\",\"Non\"),IF(ABS(S64)<=VLOOKUP($B64,'SeuilsComparaison-EMT'!$C$5:$J$24,8,FALSE),\"Oui\",\"Non\")),\"Oui\"))))","v":""}]
[null,"NO2 (NO2)",null,null,null,null,{"$f":"IF(OR(E65=\"\",C65=\"\"),\"\",IF(ISERROR(VLOOKUP($B65,'SeuilsComparaison-EMT'!$C$5:$J$24,4,FALSE)),\"-\",IF(OR(IF(ISTEXT(E65)=TRUE,SUBSTITUTE(E65,\"<\",\"\",1)*1,E65)>VLOOKUP($B65,'SeuilsComparaison-EMT'!$C$5:$J$24,4,FALSE),IF(ISTEXT(C65)=TRUE,SUBSTITUTE(C65,\"<\",\"\",1)*1,C65)>VLOOKUP($B65,'SeuilsComparaison-EMT'!$C$5:$J$24,4,FALSE)=TRUE),(IF(ISTEXT(C65)=TRUE,SUBSTITUTE(C65,\"<\",\"\",1)*1,C65)-((IF(ISTEXT(C65)=TRUE,SUBSTITUTE(C65,\"<\",\"\",1)*1,C65)+IF(ISTEXT(E65)=TRUE,SUBSTITUTE(E65,\"<\",\"\",1)*1,E65))/2))/((IF(ISTEXT(C65)=TRUE,SUBSTITUTE(C65,\"<\",\"\",1)*1,C65)+IF(ISTEXT(E65)=TRUE,SUBSTITUTE(E65,\"<\",\"\",1),E65))/2),\"-\")))","v":""},{"$f":"IF(OR(E65=\"\",C65=\"\"),\"\",IF(AND(D65=\"Oui\",F65=\"Oui\"),\"Oui\",IF(G65=\"-\",\"Oui\",IF(OR(E65>VLOOKUP($B65,'SeuilsComparaison-EMT'!$C$5:$J$24,4,FALSE),C65>VLOOKUP($B65,'SeuilsComparaison-EMT'!$C$5:$J$24,4,FALSE)=TRUE),IF(C65<=VLOOKUP($B65,'SeuilsComparaison-EMT'!$C$5:$J$24,5,FALSE),IF(ABS(G65)<=VLOOKUP($B65,'SeuilsComparaison-EMT'!$C$5:$J$24,6,FALSE),\"Oui\",\"Non\"),IF(ABS(G65)<=VLOOKUP($B65,'SeuilsComparaison-EMT'!$C$5:$J$24,8,FALSE),\"Oui\",\"Non\")),\"Oui\"))))","v":""},null,null,null,null,{"$f":"IF(OR(K65=\"\",I65=\"\"),\"\",IF(ISERROR(VLOOKUP($B65,'SeuilsComparaison-EMT'!$C$5:$J$24,4,FALSE)),\"-\",IF(OR(IF(ISTEXT(K65)=TRUE,SUBSTITUTE(K65,\"<\",\"\",1)*1,K65)>VLOOKUP($B65,'SeuilsComparaison-EMT'!$C$5:$J$24,4,FALSE),IF(ISTEXT(I65)=TRUE,SUBSTITUTE(I65,\"<\",\"\",1)*1,I65)>VLOOKUP($B65,'SeuilsComparaison-EMT'!$C$5:$J$24,4,FALSE)=TRUE),(IF(ISTEXT(I65)=TRUE,SUBSTITUTE(I65,\"<\",\"\",1)*1,I65)-((IF(ISTEXT(I65)=TRUE,SUBSTITUTE(I65,\"<\",\"\",1)*1,I65)+IF(ISTEXT(K65)=TRUE,SUBSTITUTE(K65,\"<\",\"\",1)*1,K65))/2))/((IF(ISTEXT(I65)=TRUE,SUBSTITUTE(I65,\"<\",\"\",1)*1,I65)+IF(ISTEXT(K65)=TRUE,SUBSTITUTE(K65,\"<\",\"\",1),K65))/2),\"-\")))","v":""},{"$f":"IF(OR(K65=\"\",I65=\"\"),\"\",IF(AND(J65=\"Oui\",L65=\"Oui\"),\"Oui\",IF(M65=\"-\",\"Oui\",IF(OR(K65>VLOOKUP($B65,'SeuilsComparaison-EMT'!$C$5:$J$24,4,FALSE),I65>VLOOKUP($B65,'SeuilsComparaison-EMT'!$C$5:$J$24,4,FALSE)=TRUE),IF(I65<=VLOOKUP($B65,'SeuilsComparaison-EMT'!$C$5:$J$24,5,FALSE),IF(ABS(M65)<=VLOOKUP($B65,'SeuilsComparaison-EMT'!$C$5:$J$24,6,FALSE),\"Oui\",\"Non\"),IF(ABS(M65)<=VLOOKUP($B65,'SeuilsComparaison-EMT'!$C$5:$J$24,8,FALSE),\"Oui\",\"Non\")),\"Oui\"))))","v":""},null,null,null,null,{"$f":"IF(OR(Q65=\"\",O65=\"\"),\"\",IF(ISERROR(VLOOKUP($B65,'SeuilsComparaison-EMT'!$C$5:$J$24,4,FALSE)),\"-\",IF(OR(IF(ISTEXT(Q65)=TRUE,SUBSTITUTE(Q65,\"<\",\"\",1)*1,Q65)>VLOOKUP($B65,'SeuilsComparaison-EMT'!$C$5:$J$24,4,FALSE),IF(ISTEXT(O65)=TRUE,SUBSTITUTE(O65,\"<\",\"\",1)*1,O65)>VLOOKUP($B65,'SeuilsComparaison-EMT'!$C$5:$J$24,4,FALSE)=TRUE),(IF(ISTEXT(O65)=TRUE,SUBSTITUTE(O65,\"<\",\"\",1)*1,O65)-((IF(ISTEXT(O65)=TRUE,SUBSTITUTE(O65,\"<\",\"\",1)*1,O65)+IF(ISTEXT(Q65)=TRUE,SUBSTITUTE(Q65,\"<\",\"\",1)*1,Q65))/2))/((IF(ISTEXT(O65)=TRUE,SUBSTITUTE(O65,\"<\",\"\",1)*1,O65)+IF(ISTEXT(Q65)=TRUE,SUBSTITUTE(Q65,\"<\",\"\",1),Q65))/2),\"-\")))","v":""},{"$f":"IF(OR(Q65=\"\",O65=\"\"),\"\",IF(AND(P65=\"Oui\",R65=\"Oui\"),\"Oui\",IF(S65=\"-\",\"Oui\",IF(OR(Q65>VLOOKUP($B65,'SeuilsComparaison-EMT'!$C$5:$J$24,4,FALSE),O65>VLOOKUP($B65,'SeuilsComparaison-EMT'!$C$5:$J$24,4,FALSE)=TRUE),IF(O65<=VLOOKUP($B65,'SeuilsComparaison-EMT'!$C$5:$J$24,5,FALSE),IF(ABS(S65)<=VLOOKUP($B65,'SeuilsComparaison-EMT'!$C$5:$J$24,6,FALSE),\"Oui\",\"Non\"),IF(ABS(S65)<=VLOOKUP($B65,'SeuilsComparaison-EMT'!$C$5:$J$24,8,FALSE),\"Oui\",\"Non\")),\"Oui\"))))","v":""}]
[null,"NO3 (NO3)",null,null,null,null,{"$f":"IF(OR(E66=\"\",C66=\"\"),\"\",IF(ISERROR(VLOOKUP($B66,'SeuilsComparaison-EMT'!$C$5:$J$24,4,FALSE)),\"-\",IF(OR(IF(ISTEXT(E66)=TRUE,SUBSTITUTE(E66,\"<\",\"\",1)*1,E66)>VLOOKUP($B66,'SeuilsComparaison-EMT'!$C$5:$J$24,4,FALSE),IF(ISTEXT(C66)=TRUE,SUBSTITUTE(C66,\"<\",\"\",1)*1,C66)>VLOOKUP($B66,'SeuilsComparaison-EMT'!$C$5:$J$24,4,FALSE)=TRUE),(IF(ISTEXT(C66)=TRUE,SUBSTITUTE(C66,\"<\",\"\",1)*1,C66)-((IF(ISTEXT(C66)=TRUE,SUBSTITUTE(C66,\"<\",\"\",1)*1,C66)+IF(ISTEXT(E66)=TRUE,SUBSTITUTE(E66,\"<\",\"\",1)*1,E66))/2))/((IF(ISTEXT(C66)=TRUE,SUBSTITUTE(C66,\"<\",\"\",1)*1,C66)+IF(ISTEXT(E66)=TRUE,SUBSTITUTE(E66,\"<\",\"\",1),E66))/2),\"-\")))","v":""},{"$f":"IF(OR(E66=\"\",C66=\"\"),\"\",IF(AND(D66=\"Oui\",F66=\"Oui\"),\"Oui\",IF(G66=\"-\",\"Oui\",IF(OR(E66>VLOOKUP($B66,'SeuilsComparaison-EMT'!$C$5:$J$24,4,FALSE),C66>VLOOKUP($B66,'SeuilsComparaison-EMT'!$C$5:$J$24,4,FALSE)=TRUE),IF(C66<=VLOOKUP($B66,'SeuilsComparaison-EMT'!$C$5:$J$24,5,FALSE),IF(ABS(G66)<=VLOOKUP($B66,'SeuilsComparaison-EMT'!$C$5:$J$24,6,FALSE),\"Oui\",\"Non\"),IF(ABS(G66)<=VLOOKUP($B66,'SeuilsComparaison-EMT'!$C$5:$J$24,8,FALSE),\"Oui\",\"Non\")),\"Oui\"))))","v":""},null,null,null,null,{"$f":"IF(OR(K66=\"\",I66=\"\"),\"\",IF(ISERROR(VLOOKUP($B66,'SeuilsComparaison-EMT'!$C$5:$J$24,4,FALSE)),\"-\",IF(OR(IF(ISTEXT(K66)=TRUE,SUBSTITUTE(K66,\"<\",\"\",1)*1,K66)>VLOOKUP($B66,'SeuilsComparaison-EMT'!$C$5:$J$24,4,FALSE),IF(ISTEXT(I66)=TRUE,SUBSTITUTE(I66,\"<\",\"\",1)*1,I66)>VLOOKUP($B66,'SeuilsComparaison-EMT'!$C$5:$J$24,4,FALSE)=TRUE),(IF(ISTEXT(I66)=TRUE,SUBSTITUTE(I66,\"<\",\"\",1)*1,I66)-((IF(ISTEXT(I66)=TRUE,SUBSTITUTE(I66,\"<\",\"\",1)*1,I66)+IF(ISTEXT(K66)=TRUE,SUBSTITUTE(K66,\"<\",\"\",1)*1,K66))/2))/((IF(ISTEXT(I66)=TRUE,SUBSTITUTE(I66,\"<\",\"\",1)*1,I66)+IF(ISTEXT(K66)=TRUE,SUBSTITUTE(K66,\"<\",\"\",1),K66))/2),\"-\")))","v":""},{"$f":"IF(OR(K66=\"\",I66=\"\"),\"\",IF(AND(J66=\"Oui\",L66=\"Oui\"),\"Oui\",IF(M66=\"-\",\"Oui\",IF(OR(K66>VLOOKUP($B66,'SeuilsComparaison-EMT'!$C$5:$J$24,4,FALSE),I66>VLOOKUP($B66,'SeuilsComparaison-EMT'!$C$5:$J$24,4,FALSE)=TRUE),IF(I66<=VLOOKUP($B66,'SeuilsComparaison-EMT'!$C$5:$J$24,5,FALSE),IF(ABS(M66)<=VLOOKUP($B66,'SeuilsComparaison-EMT'!$C$5:$J$24,6,FALSE),\"Oui\",\"Non\"),IF(ABS(M66)<=VLOOKUP($B66,'SeuilsComparaison-EMT'!$C$5:$J$24,8,FALSE),\"Oui\",\"Non\")),\"Oui\"))))","v":""},null,null,null,null,{"$f":"IF(OR(Q66=\"\",O66=\"\"),\"\",IF(ISERROR(VLOOKUP($B66,'SeuilsComparaison-EMT'!$C$5:$J$24,4,FALSE)),\"-\",IF(OR(IF(ISTEXT(Q66)=TRUE,SUBSTITUTE(Q66,\"<\",\"\",1)*1,Q66)>VLOOKUP($B66,'SeuilsComparaison-EMT'!$C$5:$J$24,4,FALSE),IF(ISTEXT(O66)=TRUE,SUBSTITUTE(O66,\"<\",\"\",1)*1,O66)>VLOOKUP($B66,'SeuilsComparaison-EMT'!$C$5:$J$24,4,FALSE)=TRUE),(IF(ISTEXT(O66)=TRUE,SUBSTITUTE(O66,\"<\",\"\",1)*1,O66)-((IF(ISTEXT(O66)=TRUE,SUBSTITUTE(O66,\"<\",\"\",1)*1,O66)+IF(ISTEXT(Q66)=TRUE,SUBSTITUTE(Q66,\"<\",\"\",1)*1,Q66))/2))/((IF(ISTEXT(O66)=TRUE,SUBSTITUTE(O66,\"<\",\"\",1)*1,O66)+IF(ISTEXT(Q66)=TRUE,SUBSTITUTE(Q66,\"<\",\"\",1),Q66))/2),\"-\")))","v":""},{"$f":"IF(OR(Q66=\"\",O66=\"\"),\"\",IF(AND(P66=\"Oui\",R66=\"Oui\"),\"Oui\",IF(S66=\"-\",\"Oui\",IF(OR(Q66>VLOOKUP($B66,'SeuilsComparaison-EMT'!$C$5:$J$24,4,FALSE),O66>VLOOKUP($B66,'SeuilsComparaison-EMT'!$C$5:$J$24,4,FALSE)=TRUE),IF(O66<=VLOOKUP($B66,'SeuilsComparaison-EMT'!$C$5:$J$24,5,FALSE),IF(ABS(S66)<=VLOOKUP($B66,'SeuilsComparaison-EMT'!$C$5:$J$24,6,FALSE),\"Oui\",\"Non\"),IF(ABS(S66)<=VLOOKUP($B66,'SeuilsComparaison-EMT'!$C$5:$J$24,8,FALSE),\"Oui\",\"Non\")),\"Oui\"))))","v":""}]
[null,"NGL",null,null,null,null,{"$f":"IF(OR(E67=\"\",C67=\"\"),\"\",IF(ISERROR(VLOOKUP($B67,'SeuilsComparaison-EMT'!$C$5:$J$24,4,FALSE)),\"-\",IF(OR(IF(ISTEXT(E67)=TRUE,SUBSTITUTE(E67,\"<\",\"\",1)*1,E67)>VLOOKUP($B67,'SeuilsComparaison-EMT'!$C$5:$J$24,4,FALSE),IF(ISTEXT(C67)=TRUE,SUBSTITUTE(C67,\"<\",\"\",1)*1,C67)>VLOOKUP($B67,'SeuilsComparaison-EMT'!$C$5:$J$24,4,FALSE)=TRUE),(IF(ISTEXT(C67)=TRUE,SUBSTITUTE(C67,\"<\",\"\",1)*1,C67)-((IF(ISTEXT(C67)=TRUE,SUBSTITUTE(C67,\"<\",\"\",1)*1,C67)+IF(ISTEXT(E67)=TRUE,SUBSTITUTE(E67,\"<\",\"\",1)*1,E67))/2))/((IF(ISTEXT(C67)=TRUE,SUBSTITUTE(C67,\"<\",\"\",1)*1,C67)+IF(ISTEXT(E67)=TRUE,SUBSTITUTE(E67,\"<\",\"\",1),E67))/2),\"-\")))","v":""},{"$f":"IF(OR(E67=\"\",C67=\"\"),\"\",IF(AND(D67=\"Oui\",F67=\"Oui\"),\"Oui\",IF(G67=\"-\",\"Oui\",IF(OR(E67>VLOOKUP($B67,'SeuilsComparaison-EMT'!$C$5:$J$24,4,FALSE),C67>VLOOKUP($B67,'SeuilsComparaison-EMT'!$C$5:$J$24,4,FALSE)=TRUE),IF(C67<=VLOOKUP($B67,'SeuilsComparaison-EMT'!$C$5:$J$24,5,FALSE),IF(ABS(G67)<=VLOOKUP($B67,'SeuilsComparaison-EMT'!$C$5:$J$24,6,FALSE),\"Oui\",\"Non\"),IF(ABS(G67)<=VLOOKUP($B67,'SeuilsComparaison-EMT'!$C$5:$J$24,8,FALSE),\"Oui\",\"Non\")),\"Oui\"))))","v":""},null,null,null,null,{"$f":"IF(OR(K67=\"\",I67=\"\"),\"\",IF(ISERROR(VLOOKUP($B67,'SeuilsComparaison-EMT'!$C$5:$J$24,4,FALSE)),\"-\",IF(OR(IF(ISTEXT(K67)=TRUE,SUBSTITUTE(K67,\"<\",\"\",1)*1,K67)>VLOOKUP($B67,'SeuilsComparaison-EMT'!$C$5:$J$24,4,FALSE),IF(ISTEXT(I67)=TRUE,SUBSTITUTE(I67,\"<\",\"\",1)*1,I67)>VLOOKUP($B67,'SeuilsComparaison-EMT'!$C$5:$J$24,4,FALSE)=TRUE),(IF(ISTEXT(I67)=TRUE,SUBSTITUTE(I67,\"<\",\"\",1)*1,I67)-((IF(ISTEXT(I67)=TRUE,SUBSTITUTE(I67,\"<\",\"\",1)*1,I67)+IF(ISTEXT(K67)=TRUE,SUBSTITUTE(K67,\"<\",\"\",1)*1,K67))/2))/((IF(ISTEXT(I67)=TRUE,SUBSTITUTE(I67,\"<\",\"\",1)*1,I67)+IF(ISTEXT(K67)=TRUE,SUBSTITUTE(K67,\"<\",\"\",1),K67))/2),\"-\")))","v":""},{"$f":"IF(OR(K67=\"\",I67=\"\"),\"\",IF(AND(J67=\"Oui\",L67=\"Oui\"),\"Oui\",IF(M67=\"-\",\"Oui\",IF(OR(K67>VLOOKUP($B67,'SeuilsComparaison-EMT'!$C$5:$J$24,4,FALSE),I67>VLOOKUP($B67,'SeuilsComparaison-EMT'!$C$5:$J$24,4,FALSE)=TRUE),IF(I67<=VLOOKUP($B67,'SeuilsComparaison-EMT'!$C$5:$J$24,5,FALSE),IF(ABS(M67)<=VLOOKUP($B67,'SeuilsComparaison-EMT'!$C$5:$J$24,6,FALSE),\"Oui\",\"Non\"),IF(ABS(M67)<=VLOOKUP($B67,'SeuilsComparaison-EMT'!$C$5:$J$24,8,FALSE),\"Oui\",\"Non\")),\"Oui\"))))","v":""},null,null,null,null,{"$f":"IF(OR(Q67=\"\",O67=\"\"),\"\",IF(ISERROR(VLOOKUP($B67,'SeuilsComparaison-EMT'!$C$5:$J$24,4,FALSE)),\"-\",IF(OR(IF(ISTEXT(Q67)=TRUE,SUBSTITUTE(Q67,\"<\",\"\",1)*1,Q67)>VLOOKUP($B67,'SeuilsComparaison-EMT'!$C$5:$J$24,4,FALSE),IF(ISTEXT(O67)=TRUE,SUBSTITUTE(O67,\"<\",\"\",1)*1,O67)>VLOOKUP($B67,'SeuilsComparaison-EMT'!$C$5:$J$24,4,FALSE)=TRUE),(IF(ISTEXT(O67)=TRUE,SUBSTITUTE(O67,\"<\",\"\",1)*1,O67)-((IF(ISTEXT(O67)=TRUE,SUBSTITUTE(O67,\"<\",\"\",1)*1,O67)+IF(ISTEXT(Q67)=TRUE,SUBSTITUTE(Q67,\"<\",\"\",1)*1,Q67))/2))/((IF(ISTEXT(O67)=TRUE,SUBSTITUTE(O67,\"<\",\"\",1)*1,O67)+IF(ISTEXT(Q67)=TRUE,SUBSTITUTE(Q67,\"<\",\"\",1),Q67))/2),\"-\")))","v":""},{"$f":"IF(OR(Q67=\"\",O67=\"\"),\"\",IF(AND(P67=\"Oui\",R67=\"Oui\"),\"Oui\",IF(S67=\"-\",\"Oui\",IF(OR(Q67>VLOOKUP($B67,'SeuilsComparaison-EMT'!$C$5:$J$24,4,FALSE),O67>VLOOKUP($B67,'SeuilsComparaison-EMT'!$C$5:$J$24,4,FALSE)=TRUE),IF(O67<=VLOOKUP($B67,'SeuilsComparaison-EMT'!$C$5:$J$24,5,FALSE),IF(ABS(S67)<=VLOOKUP($B67,'SeuilsComparaison-EMT'!$C$5:$J$24,6,FALSE),\"Oui\",\"Non\"),IF(ABS(S67)<=VLOOKUP($B67,'SeuilsComparaison-EMT'!$C$5:$J$24,8,FALSE),\"Oui\",\"Non\")),\"Oui\"))))","v":""}]
[null,"PT",null,null,null,null,{"$f":"IF(OR(E68=\"\",C68=\"\"),\"\",IF(ISERROR(VLOOKUP($B68,'SeuilsComparaison-EMT'!$C$5:$J$24,4,FALSE)),\"-\",IF(OR(IF(ISTEXT(E68)=TRUE,SUBSTITUTE(E68,\"<\",\"\",1)*1,E68)>VLOOKUP($B68,'SeuilsComparaison-EMT'!$C$5:$J$24,4,FALSE),IF(ISTEXT(C68)=TRUE,SUBSTITUTE(C68,\"<\",\"\",1)*1,C68)>VLOOKUP($B68,'SeuilsComparaison-EMT'!$C$5:$J$24,4,FALSE)=TRUE),(IF(ISTEXT(C68)=TRUE,SUBSTITUTE(C68,\"<\",\"\",1)*1,C68)-((IF(ISTEXT(C68)=TRUE,SUBSTITUTE(C68,\"<\",\"\",1)*1,C68)+IF(ISTEXT(E68)=TRUE,SUBSTITUTE(E68,\"<\",\"\",1)*1,E68))/2))/((IF(ISTEXT(C68)=TRUE,SUBSTITUTE(C68,\"<\",\"\",1)*1,C68)+IF(ISTEXT(E68)=TRUE,SUBSTITUTE(E68,\"<\",\"\",1),E68))/2),\"-\")))","v":""},{"$f":"IF(OR(E68=\"\",C68=\"\"),\"\",IF(AND(D68=\"Oui\",F68=\"Oui\"),\"Oui\",IF(G68=\"-\",\"Oui\",IF(OR(E68>VLOOKUP($B68,'SeuilsComparaison-EMT'!$C$5:$J$24,4,FALSE),C68>VLOOKUP($B68,'SeuilsComparaison-EMT'!$C$5:$J$24,4,FALSE)=TRUE),IF(C68<=VLOOKUP($B68,'SeuilsComparaison-EMT'!$C$5:$J$24,5,FALSE),IF(ABS(G68)<=VLOOKUP($B68,'SeuilsComparaison-EMT'!$C$5:$J$24,6,FALSE),\"Oui\",\"Non\"),IF(ABS(G68)<=VLOOKUP($B68,'SeuilsComparaison-EMT'!$C$5:$J$24,8,FALSE),\"Oui\",\"Non\")),\"Oui\"))))","v":""},null,null,null,null,{"$f":"IF(OR(K68=\"\",I68=\"\"),\"\",IF(ISERROR(VLOOKUP($B68,'SeuilsComparaison-EMT'!$C$5:$J$24,4,FALSE)),\"-\",IF(OR(IF(ISTEXT(K68)=TRUE,SUBSTITUTE(K68,\"<\",\"\",1)*1,K68)>VLOOKUP($B68,'SeuilsComparaison-EMT'!$C$5:$J$24,4,FALSE),IF(ISTEXT(I68)=TRUE,SUBSTITUTE(I68,\"<\",\"\",1)*1,I68)>VLOOKUP($B68,'SeuilsComparaison-EMT'!$C$5:$J$24,4,FALSE)=TRUE),(IF(ISTEXT(I68)=TRUE,SUBSTITUTE(I68,\"<\",\"\",1)*1,I68)-((IF(ISTEXT(I68)=TRUE,SUBSTITUTE(I68,\"<\",\"\",1)*1,I68)+IF(ISTEXT(K68)=TRUE,SUBSTITUTE(K68,\"<\",\"\",1)*1,K68))/2))/((IF(ISTEXT(I68)=TRUE,SUBSTITUTE(I68,\"<\",\"\",1)*1,I68)+IF(ISTEXT(K68)=TRUE,SUBSTITUTE(K68,\"<\",\"\",1),K68))/2),\"-\")))","v":""},{"$f":"IF(OR(K68=\"\",I68=\"\"),\"\",IF(AND(J68=\"Oui\",L68=\"Oui\"),\"Oui\",IF(M68=\"-\",\"Oui\",IF(OR(K68>VLOOKUP($B68,'SeuilsComparaison-EMT'!$C$5:$J$24,4,FALSE),I68>VLOOKUP($B68,'SeuilsComparaison-EMT'!$C$5:$J$24,4,FALSE)=TRUE),IF(I68<=VLOOKUP($B68,'SeuilsComparaison-EMT'!$C$5:$J$24,5,FALSE),IF(ABS(M68)<=VLOOKUP($B68,'SeuilsComparaison-EMT'!$C$5:$J$24,6,FALSE),\"Oui\",\"Non\"),IF(ABS(M68)<=VLOOKUP($B68,'SeuilsComparaison-EMT'!$C$5:$J$24,8,FALSE),\"Oui\",\"Non\")),\"Oui\"))))","v":""},null,null,null,null,{"$f":"IF(OR(Q68=\"\",O68=\"\"),\"\",IF(ISERROR(VLOOKUP($B68,'SeuilsComparaison-EMT'!$C$5:$J$24,4,FALSE)),\"-\",IF(OR(IF(ISTEXT(Q68)=TRUE,SUBSTITUTE(Q68,\"<\",\"\",1)*1,Q68)>VLOOKUP($B68,'SeuilsComparaison-EMT'!$C$5:$J$24,4,FALSE),IF(ISTEXT(O68)=TRUE,SUBSTITUTE(O68,\"<\",\"\",1)*1,O68)>VLOOKUP($B68,'SeuilsComparaison-EMT'!$C$5:$J$24,4,FALSE)=TRUE),(IF(ISTEXT(O68)=TRUE,SUBSTITUTE(O68,\"<\",\"\",1)*1,O68)-((IF(ISTEXT(O68)=TRUE,SUBSTITUTE(O68,\"<\",\"\",1)*1,O68)+IF(ISTEXT(Q68)=TRUE,SUBSTITUTE(Q68,\"<\",\"\",1)*1,Q68))/2))/((IF(ISTEXT(O68)=TRUE,SUBSTITUTE(O68,\"<\",\"\",1)*1,O68)+IF(ISTEXT(Q68)=TRUE,SUBSTITUTE(Q68,\"<\",\"\",1),Q68))/2),\"-\")))","v":""},{"$f":"IF(OR(Q68=\"\",O68=\"\"),\"\",IF(AND(P68=\"Oui\",R68=\"Oui\"),\"Oui\",IF(S68=\"-\",\"Oui\",IF(OR(Q68>VLOOKUP($B68,'SeuilsComparaison-EMT'!$C$5:$J$24,4,FALSE),O68>VLOOKUP($B68,'SeuilsComparaison-EMT'!$C$5:$J$24,4,FALSE)=TRUE),IF(O68<=VLOOKUP($B68,'SeuilsComparaison-EMT'!$C$5:$J$24,5,FALSE),IF(ABS(S68)<=VLOOKUP($B68,'SeuilsComparaison-EMT'!$C$5:$J$24,6,FALSE),\"Oui\",\"Non\"),IF(ABS(S68)<=VLOOKUP($B68,'SeuilsComparaison-EMT'!$C$5:$J$24,8,FALSE),\"Oui\",\"Non\")),\"Oui\"))))","v":""}]
[null,"MI",null,null,null,null,{"$f":"IF(OR(E69=\"\",C69=\"\"),\"\",IF(ISERROR(VLOOKUP($B69,'SeuilsComparaison-EMT'!$C$5:$J$24,4,FALSE)),\"-\",IF(OR(IF(ISTEXT(E69)=TRUE,SUBSTITUTE(E69,\"<\",\"\",1)*1,E69)>VLOOKUP($B69,'SeuilsComparaison-EMT'!$C$5:$J$24,4,FALSE),IF(ISTEXT(C69)=TRUE,SUBSTITUTE(C69,\"<\",\"\",1)*1,C69)>VLOOKUP($B69,'SeuilsComparaison-EMT'!$C$5:$J$24,4,FALSE)=TRUE),(IF(ISTEXT(C69)=TRUE,SUBSTITUTE(C69,\"<\",\"\",1)*1,C69)-((IF(ISTEXT(C69)=TRUE,SUBSTITUTE(C69,\"<\",\"\",1)*1,C69)+IF(ISTEXT(E69)=TRUE,SUBSTITUTE(E69,\"<\",\"\",1)*1,E69))/2))/((IF(ISTEXT(C69)=TRUE,SUBSTITUTE(C69,\"<\",\"\",1)*1,C69)+IF(ISTEXT(E69)=TRUE,SUBSTITUTE(E69,\"<\",\"\",1),E69))/2),\"-\")))","v":""},{"$f":"IF(OR(E69=\"\",C69=\"\"),\"\",IF(AND(D69=\"Oui\",F69=\"Oui\"),\"Oui\",IF(G69=\"-\",\"Oui\",IF(OR(E69>VLOOKUP($B69,'SeuilsComparaison-EMT'!$C$5:$J$24,4,FALSE),C69>VLOOKUP($B69,'SeuilsComparaison-EMT'!$C$5:$J$24,4,FALSE)=TRUE),IF(C69<=VLOOKUP($B69,'SeuilsComparaison-EMT'!$C$5:$J$24,5,FALSE),IF(ABS(G69)<=VLOOKUP($B69,'SeuilsComparaison-EMT'!$C$5:$J$24,6,FALSE),\"Oui\",\"Non\"),IF(ABS(G69)<=VLOOKUP($B69,'SeuilsComparaison-EMT'!$C$5:$J$24,8,FALSE),\"Oui\",\"Non\")),\"Oui\"))))","v":""},null,null,null,null,{"$f":"IF(OR(K69=\"\",I69=\"\"),\"\",IF(ISERROR(VLOOKUP($B69,'SeuilsComparaison-EMT'!$C$5:$J$24,4,FALSE)),\"-\",IF(OR(IF(ISTEXT(K69)=TRUE,SUBSTITUTE(K69,\"<\",\"\",1)*1,K69)>VLOOKUP($B69,'SeuilsComparaison-EMT'!$C$5:$J$24,4,FALSE),IF(ISTEXT(I69)=TRUE,SUBSTITUTE(I69,\"<\",\"\",1)*1,I69)>VLOOKUP($B69,'SeuilsComparaison-EMT'!$C$5:$J$24,4,FALSE)=TRUE),(IF(ISTEXT(I69)=TRUE,SUBSTITUTE(I69,\"<\",\"\",1)*1,I69)-((IF(ISTEXT(I69)=TRUE,SUBSTITUTE(I69,\"<\",\"\",1)*1,I69)+IF(ISTEXT(K69)=TRUE,SUBSTITUTE(K69,\"<\",\"\",1)*1,K69))/2))/((IF(ISTEXT(I69)=TRUE,SUBSTITUTE(I69,\"<\",\"\",1)*1,I69)+IF(ISTEXT(K69)=TRUE,SUBSTITUTE(K69,\"<\",\"\",1),K69))/2),\"-\")))","v":""},{"$f":"IF(OR(K69=\"\",I69=\"\"),\"\",IF(AND(J69=\"Oui\",L69=\"Oui\"),\"Oui\",IF(M69=\"-\",\"Oui\",IF(OR(K69>VLOOKUP($B69,'SeuilsComparaison-EMT'!$C$5:$J$24,4,FALSE),I69>VLOOKUP($B69,'SeuilsComparaison-EMT'!$C$5:$J$24,4,FALSE)=TRUE),IF(I69<=VLOOKUP($B69,'SeuilsComparaison-EMT'!$C$5:$J$24,5,FALSE),IF(ABS(M69)<=VLOOKUP($B69,'SeuilsComparaison-EMT'!$C$5:$J$24,6,FALSE),\"Oui\",\"Non\"),IF(ABS(M69)<=VLOOKUP($B69,'SeuilsComparaison-EMT'!$C$5:$J$24,8,FALSE),\"Oui\",\"Non\")),\"Oui\"))))","v":""},null,null,null,null,{"$f":"IF(OR(Q69=\"\",O69=\"\"),\"\",IF(ISERROR(VLOOKUP($B69,'SeuilsComparaison-EMT'!$C$5:$J$24,4,FALSE)),\"-\",IF(OR(IF(ISTEXT(Q69)=TRUE,SUBSTITUTE(Q69,\"<\",\"\",1)*1,Q69)>VLOOKUP($B69,'SeuilsComparaison-EMT'!$C$5:$J$24,4,FALSE),IF(ISTEXT(O69)=TRUE,SUBSTITUTE(O69,\"<\",\"\",1)*1,O69)>VLOOKUP($B69,'SeuilsComparaison-EMT'!$C$5:$J$24,4,FALSE)=TRUE),(IF(ISTEXT(O69)=TRUE,SUBSTITUTE(O69,\"<\",\"\",1)*1,O69)-((IF(ISTEXT(O69)=TRUE,SUBSTITUTE(O69,\"<\",\"\",1)*1,O69)+IF(ISTEXT(Q69)=TRUE,SUBSTITUTE(Q69,\"<\",\"\",1)*1,Q69))/2))/((IF(ISTEXT(O69)=TRUE,SUBSTITUTE(O69,\"<\",\"\",1)*1,O69)+IF(ISTEXT(Q69)=TRUE,SUBSTITUTE(Q69,\"<\",\"\",1),Q69))/2),\"-\")))","v":""},{"$f":"IF(OR(Q69=\"\",O69=\"\"),\"\",IF(AND(P69=\"Oui\",R69=\"Oui\"),\"Oui\",IF(S69=\"-\",\"Oui\",IF(OR(Q69>VLOOKUP($B69,'SeuilsComparaison-EMT'!$C$5:$J$24,4,FALSE),O69>VLOOKUP($B69,'SeuilsComparaison-EMT'!$C$5:$J$24,4,FALSE)=TRUE),IF(O69<=VLOOKUP($B69,'SeuilsComparaison-EMT'!$C$5:$J$24,5,FALSE),IF(ABS(S69)<=VLOOKUP($B69,'SeuilsComparaison-EMT'!$C$5:$J$24,6,FALSE),\"Oui\",\"Non\"),IF(ABS(S69)<=VLOOKUP($B69,'SeuilsComparaison-EMT'!$C$5:$J$24,8,FALSE),\"Oui\",\"Non\")),\"Oui\"))))","v":""}]
[null,"AOX",null,null,null,null,{"$f":"IF(OR(E70=\"\",C70=\"\"),\"\",IF(ISERROR(VLOOKUP($B70,'SeuilsComparaison-EMT'!$C$5:$J$24,4,FALSE)),\"-\",IF(OR(IF(ISTEXT(E70)=TRUE,SUBSTITUTE(E70,\"<\",\"\",1)*1,E70)>VLOOKUP($B70,'SeuilsComparaison-EMT'!$C$5:$J$24,4,FALSE),IF(ISTEXT(C70)=TRUE,SUBSTITUTE(C70,\"<\",\"\",1)*1,C70)>VLOOKUP($B70,'SeuilsComparaison-EMT'!$C$5:$J$24,4,FALSE)=TRUE),(IF(ISTEXT(C70)=TRUE,SUBSTITUTE(C70,\"<\",\"\",1)*1,C70)-((IF(ISTEXT(C70)=TRUE,SUBSTITUTE(C70,\"<\",\"\",1)*1,C70)+IF(ISTEXT(E70)=TRUE,SUBSTITUTE(E70,\"<\",\"\",1)*1,E70))/2))/((IF(ISTEXT(C70)=TRUE,SUBSTITUTE(C70,\"<\",\"\",1)*1,C70)+IF(ISTEXT(E70)=TRUE,SUBSTITUTE(E70,\"<\",\"\",1),E70))/2),\"-\")))","v":""},{"$f":"IF(OR(E70=\"\",C70=\"\"),\"\",IF(AND(D70=\"Oui\",F70=\"Oui\"),\"Oui\",IF(G70=\"-\",\"Oui\",IF(OR(E70>VLOOKUP($B70,'SeuilsComparaison-EMT'!$C$5:$J$24,4,FALSE),C70>VLOOKUP($B70,'SeuilsComparaison-EMT'!$C$5:$J$24,4,FALSE)=TRUE),IF(C70<=VLOOKUP($B70,'SeuilsComparaison-EMT'!$C$5:$J$24,5,FALSE),IF(ABS(G70)<=VLOOKUP($B70,'SeuilsComparaison-EMT'!$C$5:$J$24,6,FALSE),\"Oui\",\"Non\"),IF(ABS(G70)<=VLOOKUP($B70,'SeuilsComparaison-EMT'!$C$5:$J$24,8,FALSE),\"Oui\",\"Non\")),\"Oui\"))))","v":""},null,null,null,null,{"$f":"IF(OR(K70=\"\",I70=\"\"),\"\",IF(ISERROR(VLOOKUP($B70,'SeuilsComparaison-EMT'!$C$5:$J$24,4,FALSE)),\"-\",IF(OR(IF(ISTEXT(K70)=TRUE,SUBSTITUTE(K70,\"<\",\"\",1)*1,K70)>VLOOKUP($B70,'SeuilsComparaison-EMT'!$C$5:$J$24,4,FALSE),IF(ISTEXT(I70)=TRUE,SUBSTITUTE(I70,\"<\",\"\",1)*1,I70)>VLOOKUP($B70,'SeuilsComparaison-EMT'!$C$5:$J$24,4,FALSE)=TRUE),(IF(ISTEXT(I70)=TRUE,SUBSTITUTE(I70,\"<\",\"\",1)*1,I70)-((IF(ISTEXT(I70)=TRUE,SUBSTITUTE(I70,\"<\",\"\",1)*1,I70)+IF(ISTEXT(K70)=TRUE,SUBSTITUTE(K70,\"<\",\"\",1)*1,K70))/2))/((IF(ISTEXT(I70)=TRUE,SUBSTITUTE(I70,\"<\",\"\",1)*1,I70)+IF(ISTEXT(K70)=TRUE,SUBSTITUTE(K70,\"<\",\"\",1),K70))/2),\"-\")))","v":""},{"$f":"IF(OR(K70=\"\",I70=\"\"),\"\",IF(AND(J70=\"Oui\",L70=\"Oui\"),\"Oui\",IF(M70=\"-\",\"Oui\",IF(OR(K70>VLOOKUP($B70,'SeuilsComparaison-EMT'!$C$5:$J$24,4,FALSE),I70>VLOOKUP($B70,'SeuilsComparaison-EMT'!$C$5:$J$24,4,FALSE)=TRUE),IF(I70<=VLOOKUP($B70,'SeuilsComparaison-EMT'!$C$5:$J$24,5,FALSE),IF(ABS(M70)<=VLOOKUP($B70,'SeuilsComparaison-EMT'!$C$5:$J$24,6,FALSE),\"Oui\",\"Non\"),IF(ABS(M70)<=VLOOKUP($B70,'SeuilsComparaison-EMT'!$C$5:$J$24,8,FALSE),\"Oui\",\"Non\")),\"Oui\"))))","v":""},null,null,null,null,{"$f":"IF(OR(Q70=\"\",O70=\"\"),\"\",IF(ISERROR(VLOOKUP($B70,'SeuilsComparaison-EMT'!$C$5:$J$24,4,FALSE)),\"-\",IF(OR(IF(ISTEXT(Q70)=TRUE,SUBSTITUTE(Q70,\"<\",\"\",1)*1,Q70)>VLOOKUP($B70,'SeuilsComparaison-EMT'!$C$5:$J$24,4,FALSE),IF(ISTEXT(O70)=TRUE,SUBSTITUTE(O70,\"<\",\"\",1)*1,O70)>VLOOKUP($B70,'SeuilsComparaison-EMT'!$C$5:$J$24,4,FALSE)=TRUE),(IF(ISTEXT(O70)=TRUE,SUBSTITUTE(O70,\"<\",\"\",1)*1,O70)-((IF(ISTEXT(O70)=TRUE,SUBSTITUTE(O70,\"<\",\"\",1)*1,O70)+IF(ISTEXT(Q70)=TRUE,SUBSTITUTE(Q70,\"<\",\"\",1)*1,Q70))/2))/((IF(ISTEXT(O70)=TRUE,SUBSTITUTE(O70,\"<\",\"\",1)*1,O70)+IF(ISTEXT(Q70)=TRUE,SUBSTITUTE(Q70,\"<\",\"\",1),Q70))/2),\"-\")))","v":""},{"$f":"IF(OR(Q70=\"\",O70=\"\"),\"\",IF(AND(P70=\"Oui\",R70=\"Oui\"),\"Oui\",IF(S70=\"-\",\"Oui\",IF(OR(Q70>VLOOKUP($B70,'SeuilsComparaison-EMT'!$C$5:$J$24,4,FALSE),O70>VLOOKUP($B70,'SeuilsComparaison-EMT'!$C$5:$J$24,4,FALSE)=TRUE),IF(O70<=VLOOKUP($B70,'SeuilsComparaison-EMT'!$C$5:$J$24,5,FALSE),IF(ABS(S70)<=VLOOKUP($B70,'SeuilsComparaison-EMT'!$C$5:$J$24,6,FALSE),\"Oui\",\"Non\"),IF(ABS(S70)<=VLOOKUP($B70,'SeuilsComparaison-EMT'!$C$5:$J$24,8,FALSE),\"Oui\",\"Non\")),\"Oui\"))))","v":""}]
[null,"As",null,null,null,null,{"$f":"IF(OR(E71=\"\",C71=\"\"),\"\",IF(ISERROR(VLOOKUP($B71,'SeuilsComparaison-EMT'!$C$5:$J$24,4,FALSE)),\"-\",IF(OR(IF(ISTEXT(E71)=TRUE,SUBSTITUTE(E71,\"<\",\"\",1)*1,E71)>VLOOKUP($B71,'SeuilsComparaison-EMT'!$C$5:$J$24,4,FALSE),IF(ISTEXT(C71)=TRUE,SUBSTITUTE(C71,\"<\",\"\",1)*1,C71)>VLOOKUP($B71,'SeuilsComparaison-EMT'!$C$5:$J$24,4,FALSE)=TRUE),(IF(ISTEXT(C71)=TRUE,SUBSTITUTE(C71,\"<\",\"\",1)*1,C71)-((IF(ISTEXT(C71)=TRUE,SUBSTITUTE(C71,\"<\",\"\",1)*1,C71)+IF(ISTEXT(E71)=TRUE,SUBSTITUTE(E71,\"<\",\"\",1)*1,E71))/2))/((IF(ISTEXT(C71)=TRUE,SUBSTITUTE(C71,\"<\",\"\",1)*1,C71)+IF(ISTEXT(E71)=TRUE,SUBSTITUTE(E71,\"<\",\"\",1),E71))/2),\"-\")))","v":""},{"$f":"IF(OR(E71=\"\",C71=\"\"),\"\",IF(AND(D71=\"Oui\",F71=\"Oui\"),\"Oui\",IF(G71=\"-\",\"Oui\",IF(OR(E71>VLOOKUP($B71,'SeuilsComparaison-EMT'!$C$5:$J$24,4,FALSE),C71>VLOOKUP($B71,'SeuilsComparaison-EMT'!$C$5:$J$24,4,FALSE)=TRUE),IF(C71<=VLOOKUP($B71,'SeuilsComparaison-EMT'!$C$5:$J$24,5,FALSE),IF(ABS(G71)<=VLOOKUP($B71,'SeuilsComparaison-EMT'!$C$5:$J$24,6,FALSE),\"Oui\",\"Non\"),IF(ABS(G71)<=VLOOKUP($B71,'SeuilsComparaison-EMT'!$C$5:$J$24,8,FALSE),\"Oui\",\"Non\")),\"Oui\"))))","v":""},null,null,null,null,{"$f":"IF(OR(K71=\"\",I71=\"\"),\"\",IF(ISERROR(VLOOKUP($B71,'SeuilsComparaison-EMT'!$C$5:$J$24,4,FALSE)),\"-\",IF(OR(IF(ISTEXT(K71)=TRUE,SUBSTITUTE(K71,\"<\",\"\",1)*1,K71)>VLOOKUP($B71,'SeuilsComparaison-EMT'!$C$5:$J$24,4,FALSE),IF(ISTEXT(I71)=TRUE,SUBSTITUTE(I71,\"<\",\"\",1)*1,I71)>VLOOKUP($B71,'SeuilsComparaison-EMT'!$C$5:$J$24,4,FALSE)=TRUE),(IF(ISTEXT(I71)=TRUE,SUBSTITUTE(I71,\"<\",\"\",1)*1,I71)-((IF(ISTEXT(I71)=TRUE,SUBSTITUTE(I71,\"<\",\"\",1)*1,I71)+IF(ISTEXT(K71)=TRUE,SUBSTITUTE(K71,\"<\",\"\",1)*1,K71))/2))/((IF(ISTEXT(I71)=TRUE,SUBSTITUTE(I71,\"<\",\"\",1)*1,I71)+IF(ISTEXT(K71)=TRUE,SUBSTITUTE(K71,\"<\",\"\",1),K71))/2),\"-\")))","v":""},{"$f":"IF(OR(K71=\"\",I71=\"\"),\"\",IF(AND(J71=\"Oui\",L71=\"Oui\"),\"Oui\",IF(M71=\"-\",\"Oui\",IF(OR(K71>VLOOKUP($B71,'SeuilsComparaison-EMT'!$C$5:$J$24,4,FALSE),I71>VLOOKUP($B71,'SeuilsComparaison-EMT'!$C$5:$J$24,4,FALSE)=TRUE),IF(I71<=VLOOKUP($B71,'SeuilsComparaison-EMT'!$C$5:$J$24,5,FALSE),IF(ABS(M71)<=VLOOKUP($B71,'SeuilsComparaison-EMT'!$C$5:$J$24,6,FALSE),\"Oui\",\"Non\"),IF(ABS(M71)<=VLOOKUP($B71,'SeuilsComparaison-EMT'!$C$5:$J$24,8,FALSE),\"Oui\",\"Non\")),\"Oui\"))))","v":""},null,null,null,null,{"$f":"IF(OR(Q71=\"\",O71=\"\"),\"\",IF(ISERROR(VLOOKUP($B71,'SeuilsComparaison-EMT'!$C$5:$J$24,4,FALSE)),\"-\",IF(OR(IF(ISTEXT(Q71)=TRUE,SUBSTITUTE(Q71,\"<\",\"\",1)*1,Q71)>VLOOKUP($B71,'SeuilsComparaison-EMT'!$C$5:$J$24,4,FALSE),IF(ISTEXT(O71)=TRUE,SUBSTITUTE(O71,\"<\",\"\",1)*1,O71)>VLOOKUP($B71,'SeuilsComparaison-EMT'!$C$5:$J$24,4,FALSE)=TRUE),(IF(ISTEXT(O71)=TRUE,SUBSTITUTE(O71,\"<\",\"\",1)*1,O71)-((IF(ISTEXT(O71)=TRUE,SUBSTITUTE(O71,\"<\",\"\",1)*1,O71)+IF(ISTEXT(Q71)=TRUE,SUBSTITUTE(Q71,\"<\",\"\",1)*1,Q71))/2))/((IF(ISTEXT(O71)=TRUE,SUBSTITUTE(O71,\"<\",\"\",1)*1,O71)+IF(ISTEXT(Q71)=TRUE,SUBSTITUTE(Q71,\"<\",\"\",1),Q71))/2),\"-\")))","v":""},{"$f":"IF(OR(Q71=\"\",O71=\"\"),\"\",IF(AND(P71=\"Oui\",R71=\"Oui\"),\"Oui\",IF(S71=\"-\",\"Oui\",IF(OR(Q71>VLOOKUP($B71,'SeuilsComparaison-EMT'!$C$5:$J$24,4,FALSE),O71>VLOOKUP($B71,'SeuilsComparaison-EMT'!$C$5:$J$24,4,FALSE)=TRUE),IF(O71<=VLOOKUP($B71,'SeuilsComparaison-EMT'!$C$5:$J$24,5,FALSE),IF(ABS(S71)<=VLOOKUP($B71,'SeuilsComparaison-EMT'!$C$5:$J$24,6,FALSE),\"Oui\",\"Non\"),IF(ABS(S71)<=VLOOKUP($B71,'SeuilsComparaison-EMT'!$C$5:$J$24,8,FALSE),\"Oui\",\"Non\")),\"Oui\"))))","v":""}]
[null,"Cd",null,null,null,null,{"$f":"IF(OR(E72=\"\",C72=\"\"),\"\",IF(ISERROR(VLOOKUP($B72,'SeuilsComparaison-EMT'!$C$5:$J$24,4,FALSE)),\"-\",IF(OR(IF(ISTEXT(E72)=TRUE,SUBSTITUTE(E72,\"<\",\"\",1)*1,E72)>VLOOKUP($B72,'SeuilsComparaison-EMT'!$C$5:$J$24,4,FALSE),IF(ISTEXT(C72)=TRUE,SUBSTITUTE(C72,\"<\",\"\",1)*1,C72)>VLOOKUP($B72,'SeuilsComparaison-EMT'!$C$5:$J$24,4,FALSE)=TRUE),(IF(ISTEXT(C72)=TRUE,SUBSTITUTE(C72,\"<\",\"\",1)*1,C72)-((IF(ISTEXT(C72)=TRUE,SUBSTITUTE(C72,\"<\",\"\",1)*1,C72)+IF(ISTEXT(E72)=TRUE,SUBSTITUTE(E72,\"<\",\"\",1)*1,E72))/2))/((IF(ISTEXT(C72)=TRUE,SUBSTITUTE(C72,\"<\",\"\",1)*1,C72)+IF(ISTEXT(E72)=TRUE,SUBSTITUTE(E72,\"<\",\"\",1),E72))/2),\"-\")))","v":""},{"$f":"IF(OR(E72=\"\",C72=\"\"),\"\",IF(AND(D72=\"Oui\",F72=\"Oui\"),\"Oui\",IF(G72=\"-\",\"Oui\",IF(OR(E72>VLOOKUP($B72,'SeuilsComparaison-EMT'!$C$5:$J$24,4,FALSE),C72>VLOOKUP($B72,'SeuilsComparaison-EMT'!$C$5:$J$24,4,FALSE)=TRUE),IF(C72<=VLOOKUP($B72,'SeuilsComparaison-EMT'!$C$5:$J$24,5,FALSE),IF(ABS(G72)<=VLOOKUP($B72,'SeuilsComparaison-EMT'!$C$5:$J$24,6,FALSE),\"Oui\",\"Non\"),IF(ABS(G72)<=VLOOKUP($B72,'SeuilsComparaison-EMT'!$C$5:$J$24,8,FALSE),\"Oui\",\"Non\")),\"Oui\"))))","v":""},null,null,null,null,{"$f":"IF(OR(K72=\"\",I72=\"\"),\"\",IF(ISERROR(VLOOKUP($B72,'SeuilsComparaison-EMT'!$C$5:$J$24,4,FALSE)),\"-\",IF(OR(IF(ISTEXT(K72)=TRUE,SUBSTITUTE(K72,\"<\",\"\",1)*1,K72)>VLOOKUP($B72,'SeuilsComparaison-EMT'!$C$5:$J$24,4,FALSE),IF(ISTEXT(I72)=TRUE,SUBSTITUTE(I72,\"<\",\"\",1)*1,I72)>VLOOKUP($B72,'SeuilsComparaison-EMT'!$C$5:$J$24,4,FALSE)=TRUE),(IF(ISTEXT(I72)=TRUE,SUBSTITUTE(I72,\"<\",\"\",1)*1,I72)-((IF(ISTEXT(I72)=TRUE,SUBSTITUTE(I72,\"<\",\"\",1)*1,I72)+IF(ISTEXT(K72)=TRUE,SUBSTITUTE(K72,\"<\",\"\",1)*1,K72))/2))/((IF(ISTEXT(I72)=TRUE,SUBSTITUTE(I72,\"<\",\"\",1)*1,I72)+IF(ISTEXT(K72)=TRUE,SUBSTITUTE(K72,\"<\",\"\",1),K72))/2),\"-\")))","v":""},{"$f":"IF(OR(K72=\"\",I72=\"\"),\"\",IF(AND(J72=\"Oui\",L72=\"Oui\"),\"Oui\",IF(M72=\"-\",\"Oui\",IF(OR(K72>VLOOKUP($B72,'SeuilsComparaison-EMT'!$C$5:$J$24,4,FALSE),I72>VLOOKUP($B72,'SeuilsComparaison-EMT'!$C$5:$J$24,4,FALSE)=TRUE),IF(I72<=VLOOKUP($B72,'SeuilsComparaison-EMT'!$C$5:$J$24,5,FALSE),IF(ABS(M72)<=VLOOKUP($B72,'SeuilsComparaison-EMT'!$C$5:$J$24,6,FALSE),\"Oui\",\"Non\"),IF(ABS(M72)<=VLOOKUP($B72,'SeuilsComparaison-EMT'!$C$5:$J$24,8,FALSE),\"Oui\",\"Non\")),\"Oui\"))))","v":""},null,null,null,null,{"$f":"IF(OR(Q72=\"\",O72=\"\"),\"\",IF(ISERROR(VLOOKUP($B72,'SeuilsComparaison-EMT'!$C$5:$J$24,4,FALSE)),\"-\",IF(OR(IF(ISTEXT(Q72)=TRUE,SUBSTITUTE(Q72,\"<\",\"\",1)*1,Q72)>VLOOKUP($B72,'SeuilsComparaison-EMT'!$C$5:$J$24,4,FALSE),IF(ISTEXT(O72)=TRUE,SUBSTITUTE(O72,\"<\",\"\",1)*1,O72)>VLOOKUP($B72,'SeuilsComparaison-EMT'!$C$5:$J$24,4,FALSE)=TRUE),(IF(ISTEXT(O72)=TRUE,SUBSTITUTE(O72,\"<\",\"\",1)*1,O72)-((IF(ISTEXT(O72)=TRUE,SUBSTITUTE(O72,\"<\",\"\",1)*1,O72)+IF(ISTEXT(Q72)=TRUE,SUBSTITUTE(Q72,\"<\",\"\",1)*1,Q72))/2))/((IF(ISTEXT(O72)=TRUE,SUBSTITUTE(O72,\"<\",\"\",1)*1,O72)+IF(ISTEXT(Q72)=TRUE,SUBSTITUTE(Q72,\"<\",\"\",1),Q72))/2),\"-\")))","v":""},{"$f":"IF(OR(Q72=\"\",O72=\"\"),\"\",IF(AND(P72=\"Oui\",R72=\"Oui\"),\"Oui\",IF(S72=\"-\",\"Oui\",IF(OR(Q72>VLOOKUP($B72,'SeuilsComparaison-EMT'!$C$5:$J$24,4,FALSE),O72>VLOOKUP($B72,'SeuilsComparaison-EMT'!$C$5:$J$24,4,FALSE)=TRUE),IF(O72<=VLOOKUP($B72,'SeuilsComparaison-EMT'!$C$5:$J$24,5,FALSE),IF(ABS(S72)<=VLOOKUP($B72,'SeuilsComparaison-EMT'!$C$5:$J$24,6,FALSE),\"Oui\",\"Non\"),IF(ABS(S72)<=VLOOKUP($B72,'SeuilsComparaison-EMT'!$C$5:$J$24,8,FALSE),\"Oui\",\"Non\")),\"Oui\"))))","v":""}]
[null,"Cr",null,null,null,null,{"$f":"IF(OR(E73=\"\",C73=\"\"),\"\",IF(ISERROR(VLOOKUP($B73,'SeuilsComparaison-EMT'!$C$5:$J$24,4,FALSE)),\"-\",IF(OR(IF(ISTEXT(E73)=TRUE,SUBSTITUTE(E73,\"<\",\"\",1)*1,E73)>VLOOKUP($B73,'SeuilsComparaison-EMT'!$C$5:$J$24,4,FALSE),IF(ISTEXT(C73)=TRUE,SUBSTITUTE(C73,\"<\",\"\",1)*1,C73)>VLOOKUP($B73,'SeuilsComparaison-EMT'!$C$5:$J$24,4,FALSE)=TRUE),(IF(ISTEXT(C73)=TRUE,SUBSTITUTE(C73,\"<\",\"\",1)*1,C73)-((IF(ISTEXT(C73)=TRUE,SUBSTITUTE(C73,\"<\",\"\",1)*1,C73)+IF(ISTEXT(E73)=TRUE,SUBSTITUTE(E73,\"<\",\"\",1)*1,E73))/2))/((IF(ISTEXT(C73)=TRUE,SUBSTITUTE(C73,\"<\",\"\",1)*1,C73)+IF(ISTEXT(E73)=TRUE,SUBSTITUTE(E73,\"<\",\"\",1),E73))/2),\"-\")))","v":""},{"$f":"IF(OR(E73=\"\",C73=\"\"),\"\",IF(AND(D73=\"Oui\",F73=\"Oui\"),\"Oui\",IF(G73=\"-\",\"Oui\",IF(OR(E73>VLOOKUP($B73,'SeuilsComparaison-EMT'!$C$5:$J$24,4,FALSE),C73>VLOOKUP($B73,'SeuilsComparaison-EMT'!$C$5:$J$24,4,FALSE)=TRUE),IF(C73<=VLOOKUP($B73,'SeuilsComparaison-EMT'!$C$5:$J$24,5,FALSE),IF(ABS(G73)<=VLOOKUP($B73,'SeuilsComparaison-EMT'!$C$5:$J$24,6,FALSE),\"Oui\",\"Non\"),IF(ABS(G73)<=VLOOKUP($B73,'SeuilsComparaison-EMT'!$C$5:$J$24,8,FALSE),\"Oui\",\"Non\")),\"Oui\"))))","v":""},null,null,null,null,{"$f":"IF(OR(K73=\"\",I73=\"\"),\"\",IF(ISERROR(VLOOKUP($B73,'SeuilsComparaison-EMT'!$C$5:$J$24,4,FALSE)),\"-\",IF(OR(IF(ISTEXT(K73)=TRUE,SUBSTITUTE(K73,\"<\",\"\",1)*1,K73)>VLOOKUP($B73,'SeuilsComparaison-EMT'!$C$5:$J$24,4,FALSE),IF(ISTEXT(I73)=TRUE,SUBSTITUTE(I73,\"<\",\"\",1)*1,I73)>VLOOKUP($B73,'SeuilsComparaison-EMT'!$C$5:$J$24,4,FALSE)=TRUE),(IF(ISTEXT(I73)=TRUE,SUBSTITUTE(I73,\"<\",\"\",1)*1,I73)-((IF(ISTEXT(I73)=TRUE,SUBSTITUTE(I73,\"<\",\"\",1)*1,I73)+IF(ISTEXT(K73)=TRUE,SUBSTITUTE(K73,\"<\",\"\",1)*1,K73))/2))/((IF(ISTEXT(I73)=TRUE,SUBSTITUTE(I73,\"<\",\"\",1)*1,I73)+IF(ISTEXT(K73)=TRUE,SUBSTITUTE(K73,\"<\",\"\",1),K73))/2),\"-\")))","v":""},{"$f":"IF(OR(K73=\"\",I73=\"\"),\"\",IF(AND(J73=\"Oui\",L73=\"Oui\"),\"Oui\",IF(M73=\"-\",\"Oui\",IF(OR(K73>VLOOKUP($B73,'SeuilsComparaison-EMT'!$C$5:$J$24,4,FALSE),I73>VLOOKUP($B73,'SeuilsComparaison-EMT'!$C$5:$J$24,4,FALSE)=TRUE),IF(I73<=VLOOKUP($B73,'SeuilsComparaison-EMT'!$C$5:$J$24,5,FALSE),IF(ABS(M73)<=VLOOKUP($B73,'SeuilsComparaison-EMT'!$C$5:$J$24,6,FALSE),\"Oui\",\"Non\"),IF(ABS(M73)<=VLOOKUP($B73,'SeuilsComparaison-EMT'!$C$5:$J$24,8,FALSE),\"Oui\",\"Non\")),\"Oui\"))))","v":""},null,null,null,null,{"$f":"IF(OR(Q73=\"\",O73=\"\"),\"\",IF(ISERROR(VLOOKUP($B73,'SeuilsComparaison-EMT'!$C$5:$J$24,4,FALSE)),\"-\",IF(OR(IF(ISTEXT(Q73)=TRUE,SUBSTITUTE(Q73,\"<\",\"\",1)*1,Q73)>VLOOKUP($B73,'SeuilsComparaison-EMT'!$C$5:$J$24,4,FALSE),IF(ISTEXT(O73)=TRUE,SUBSTITUTE(O73,\"<\",\"\",1)*1,O73)>VLOOKUP($B73,'SeuilsComparaison-EMT'!$C$5:$J$24,4,FALSE)=TRUE),(IF(ISTEXT(O73)=TRUE,SUBSTITUTE(O73,\"<\",\"\",1)*1,O73)-((IF(ISTEXT(O73)=TRUE,SUBSTITUTE(O73,\"<\",\"\",1)*1,O73)+IF(ISTEXT(Q73)=TRUE,SUBSTITUTE(Q73,\"<\",\"\",1)*1,Q73))/2))/((IF(ISTEXT(O73)=TRUE,SUBSTITUTE(O73,\"<\",\"\",1)*1,O73)+IF(ISTEXT(Q73)=TRUE,SUBSTITUTE(Q73,\"<\",\"\",1),Q73))/2),\"-\")))","v":""},{"$f":"IF(OR(Q73=\"\",O73=\"\"),\"\",IF(AND(P73=\"Oui\",R73=\"Oui\"),\"Oui\",IF(S73=\"-\",\"Oui\",IF(OR(Q73>VLOOKUP($B73,'SeuilsComparaison-EMT'!$C$5:$J$24,4,FALSE),O73>VLOOKUP($B73,'SeuilsComparaison-EMT'!$C$5:$J$24,4,FALSE)=TRUE),IF(O73<=VLOOKUP($B73,'SeuilsComparaison-EMT'!$C$5:$J$24,5,FALSE),IF(ABS(S73)<=VLOOKUP($B73,'SeuilsComparaison-EMT'!$C$5:$J$24,6,FALSE),\"Oui\",\"Non\"),IF(ABS(S73)<=VLOOKUP($B73,'SeuilsComparaison-EMT'!$C$5:$J$24,8,FALSE),\"Oui\",\"Non\")),\"Oui\"))))","v":""}]
[null,"Cu",null,null,null,null,{"$f":"IF(OR(E74=\"\",C74=\"\"),\"\",IF(ISERROR(VLOOKUP($B74,'SeuilsComparaison-EMT'!$C$5:$J$24,4,FALSE)),\"-\",IF(OR(IF(ISTEXT(E74)=TRUE,SUBSTITUTE(E74,\"<\",\"\",1)*1,E74)>VLOOKUP($B74,'SeuilsComparaison-EMT'!$C$5:$J$24,4,FALSE),IF(ISTEXT(C74)=TRUE,SUBSTITUTE(C74,\"<\",\"\",1)*1,C74)>VLOOKUP($B74,'SeuilsComparaison-EMT'!$C$5:$J$24,4,FALSE)=TRUE),(IF(ISTEXT(C74)=TRUE,SUBSTITUTE(C74,\"<\",\"\",1)*1,C74)-((IF(ISTEXT(C74)=TRUE,SUBSTITUTE(C74,\"<\",\"\",1)*1,C74)+IF(ISTEXT(E74)=TRUE,SUBSTITUTE(E74,\"<\",\"\",1)*1,E74))/2))/((IF(ISTEXT(C74)=TRUE,SUBSTITUTE(C74,\"<\",\"\",1)*1,C74)+IF(ISTEXT(E74)=TRUE,SUBSTITUTE(E74,\"<\",\"\",1),E74))/2),\"-\")))","v":""},{"$f":"IF(OR(E74=\"\",C74=\"\"),\"\",IF(AND(D74=\"Oui\",F74=\"Oui\"),\"Oui\",IF(G74=\"-\",\"Oui\",IF(OR(E74>VLOOKUP($B74,'SeuilsComparaison-EMT'!$C$5:$J$24,4,FALSE),C74>VLOOKUP($B74,'SeuilsComparaison-EMT'!$C$5:$J$24,4,FALSE)=TRUE),IF(C74<=VLOOKUP($B74,'SeuilsComparaison-EMT'!$C$5:$J$24,5,FALSE),IF(ABS(G74)<=VLOOKUP($B74,'SeuilsComparaison-EMT'!$C$5:$J$24,6,FALSE),\"Oui\",\"Non\"),IF(ABS(G74)<=VLOOKUP($B74,'SeuilsComparaison-EMT'!$C$5:$J$24,8,FALSE),\"Oui\",\"Non\")),\"Oui\"))))","v":""},null,null,null,null,{"$f":"IF(OR(K74=\"\",I74=\"\"),\"\",IF(ISERROR(VLOOKUP($B74,'SeuilsComparaison-EMT'!$C$5:$J$24,4,FALSE)),\"-\",IF(OR(IF(ISTEXT(K74)=TRUE,SUBSTITUTE(K74,\"<\",\"\",1)*1,K74)>VLOOKUP($B74,'SeuilsComparaison-EMT'!$C$5:$J$24,4,FALSE),IF(ISTEXT(I74)=TRUE,SUBSTITUTE(I74,\"<\",\"\",1)*1,I74)>VLOOKUP($B74,'SeuilsComparaison-EMT'!$C$5:$J$24,4,FALSE)=TRUE),(IF(ISTEXT(I74)=TRUE,SUBSTITUTE(I74,\"<\",\"\",1)*1,I74)-((IF(ISTEXT(I74)=TRUE,SUBSTITUTE(I74,\"<\",\"\",1)*1,I74)+IF(ISTEXT(K74)=TRUE,SUBSTITUTE(K74,\"<\",\"\",1)*1,K74))/2))/((IF(ISTEXT(I74)=TRUE,SUBSTITUTE(I74,\"<\",\"\",1)*1,I74)+IF(ISTEXT(K74)=TRUE,SUBSTITUTE(K74,\"<\",\"\",1),K74))/2),\"-\")))","v":""},{"$f":"IF(OR(K74=\"\",I74=\"\"),\"\",IF(AND(J74=\"Oui\",L74=\"Oui\"),\"Oui\",IF(M74=\"-\",\"Oui\",IF(OR(K74>VLOOKUP($B74,'SeuilsComparaison-EMT'!$C$5:$J$24,4,FALSE),I74>VLOOKUP($B74,'SeuilsComparaison-EMT'!$C$5:$J$24,4,FALSE)=TRUE),IF(I74<=VLOOKUP($B74,'SeuilsComparaison-EMT'!$C$5:$J$24,5,FALSE),IF(ABS(M74)<=VLOOKUP($B74,'SeuilsComparaison-EMT'!$C$5:$J$24,6,FALSE),\"Oui\",\"Non\"),IF(ABS(M74)<=VLOOKUP($B74,'SeuilsComparaison-EMT'!$C$5:$J$24,8,FALSE),\"Oui\",\"Non\")),\"Oui\"))))","v":""},null,null,null,null,{"$f":"IF(OR(Q74=\"\",O74=\"\"),\"\",IF(ISERROR(VLOOKUP($B74,'SeuilsComparaison-EMT'!$C$5:$J$24,4,FALSE)),\"-\",IF(OR(IF(ISTEXT(Q74)=TRUE,SUBSTITUTE(Q74,\"<\",\"\",1)*1,Q74)>VLOOKUP($B74,'SeuilsComparaison-EMT'!$C$5:$J$24,4,FALSE),IF(ISTEXT(O74)=TRUE,SUBSTITUTE(O74,\"<\",\"\",1)*1,O74)>VLOOKUP($B74,'SeuilsComparaison-EMT'!$C$5:$J$24,4,FALSE)=TRUE),(IF(ISTEXT(O74)=TRUE,SUBSTITUTE(O74,\"<\",\"\",1)*1,O74)-((IF(ISTEXT(O74)=TRUE,SUBSTITUTE(O74,\"<\",\"\",1)*1,O74)+IF(ISTEXT(Q74)=TRUE,SUBSTITUTE(Q74,\"<\",\"\",1)*1,Q74))/2))/((IF(ISTEXT(O74)=TRUE,SUBSTITUTE(O74,\"<\",\"\",1)*1,O74)+IF(ISTEXT(Q74)=TRUE,SUBSTITUTE(Q74,\"<\",\"\",1),Q74))/2),\"-\")))","v":""},{"$f":"IF(OR(Q74=\"\",O74=\"\"),\"\",IF(AND(P74=\"Oui\",R74=\"Oui\"),\"Oui\",IF(S74=\"-\",\"Oui\",IF(OR(Q74>VLOOKUP($B74,'SeuilsComparaison-EMT'!$C$5:$J$24,4,FALSE),O74>VLOOKUP($B74,'SeuilsComparaison-EMT'!$C$5:$J$24,4,FALSE)=TRUE),IF(O74<=VLOOKUP($B74,'SeuilsComparaison-EMT'!$C$5:$J$24,5,FALSE),IF(ABS(S74)<=VLOOKUP($B74,'SeuilsComparaison-EMT'!$C$5:$J$24,6,FALSE),\"Oui\",\"Non\"),IF(ABS(S74)<=VLOOKUP($B74,'SeuilsComparaison-EMT'!$C$5:$J$24,8,FALSE),\"Oui\",\"Non\")),\"Oui\"))))","v":""}]
[null,"Hg",null,null,null,null,{"$f":"IF(OR(E75=\"\",C75=\"\"),\"\",IF(ISERROR(VLOOKUP($B75,'SeuilsComparaison-EMT'!$C$5:$J$24,4,FALSE)),\"-\",IF(OR(IF(ISTEXT(E75)=TRUE,SUBSTITUTE(E75,\"<\",\"\",1)*1,E75)>VLOOKUP($B75,'SeuilsComparaison-EMT'!$C$5:$J$24,4,FALSE),IF(ISTEXT(C75)=TRUE,SUBSTITUTE(C75,\"<\",\"\",1)*1,C75)>VLOOKUP($B75,'SeuilsComparaison-EMT'!$C$5:$J$24,4,FALSE)=TRUE),(IF(ISTEXT(C75)=TRUE,SUBSTITUTE(C75,\"<\",\"\",1)*1,C75)-((IF(ISTEXT(C75)=TRUE,SUBSTITUTE(C75,\"<\",\"\",1)*1,C75)+IF(ISTEXT(E75)=TRUE,SUBSTITUTE(E75,\"<\",\"\",1)*1,E75))/2))/((IF(ISTEXT(C75)=TRUE,SUBSTITUTE(C75,\"<\",\"\",1)*1,C75)+IF(ISTEXT(E75)=TRUE,SUBSTITUTE(E75,\"<\",\"\",1),E75))/2),\"-\")))","v":""},{"$f":"IF(OR(E75=\"\",C75=\"\"),\"\",IF(AND(D75=\"Oui\",F75=\"Oui\"),\"Oui\",IF(G75=\"-\",\"Oui\",IF(OR(E75>VLOOKUP($B75,'SeuilsComparaison-EMT'!$C$5:$J$24,4,FALSE),C75>VLOOKUP($B75,'SeuilsComparaison-EMT'!$C$5:$J$24,4,FALSE)=TRUE),IF(C75<=VLOOKUP($B75,'SeuilsComparaison-EMT'!$C$5:$J$24,5,FALSE),IF(ABS(G75)<=VLOOKUP($B75,'SeuilsComparaison-EMT'!$C$5:$J$24,6,FALSE),\"Oui\",\"Non\"),IF(ABS(G75)<=VLOOKUP($B75,'SeuilsComparaison-EMT'!$C$5:$J$24,8,FALSE),\"Oui\",\"Non\")),\"Oui\"))))","v":""},null,null,null,null,{"$f":"IF(OR(K75=\"\",I75=\"\"),\"\",IF(ISERROR(VLOOKUP($B75,'SeuilsComparaison-EMT'!$C$5:$J$24,4,FALSE)),\"-\",IF(OR(IF(ISTEXT(K75)=TRUE,SUBSTITUTE(K75,\"<\",\"\",1)*1,K75)>VLOOKUP($B75,'SeuilsComparaison-EMT'!$C$5:$J$24,4,FALSE),IF(ISTEXT(I75)=TRUE,SUBSTITUTE(I75,\"<\",\"\",1)*1,I75)>VLOOKUP($B75,'SeuilsComparaison-EMT'!$C$5:$J$24,4,FALSE)=TRUE),(IF(ISTEXT(I75)=TRUE,SUBSTITUTE(I75,\"<\",\"\",1)*1,I75)-((IF(ISTEXT(I75)=TRUE,SUBSTITUTE(I75,\"<\",\"\",1)*1,I75)+IF(ISTEXT(K75)=TRUE,SUBSTITUTE(K75,\"<\",\"\",1)*1,K75))/2))/((IF(ISTEXT(I75)=TRUE,SUBSTITUTE(I75,\"<\",\"\",1)*1,I75)+IF(ISTEXT(K75)=TRUE,SUBSTITUTE(K75,\"<\",\"\",1),K75))/2),\"-\")))","v":""},{"$f":"IF(OR(K75=\"\",I75=\"\"),\"\",IF(AND(J75=\"Oui\",L75=\"Oui\"),\"Oui\",IF(M75=\"-\",\"Oui\",IF(OR(K75>VLOOKUP($B75,'SeuilsComparaison-EMT'!$C$5:$J$24,4,FALSE),I75>VLOOKUP($B75,'SeuilsComparaison-EMT'!$C$5:$J$24,4,FALSE)=TRUE),IF(I75<=VLOOKUP($B75,'SeuilsComparaison-EMT'!$C$5:$J$24,5,FALSE),IF(ABS(M75)<=VLOOKUP($B75,'SeuilsComparaison-EMT'!$C$5:$J$24,6,FALSE),\"Oui\",\"Non\"),IF(ABS(M75)<=VLOOKUP($B75,'SeuilsComparaison-EMT'!$C$5:$J$24,8,FALSE),\"Oui\",\"Non\")),\"Oui\"))))","v":""},null,null,null,null,{"$f":"IF(OR(Q75=\"\",O75=\"\"),\"\",IF(ISERROR(VLOOKUP($B75,'SeuilsComparaison-EMT'!$C$5:$J$24,4,FALSE)),\"-\",IF(OR(IF(ISTEXT(Q75)=TRUE,SUBSTITUTE(Q75,\"<\",\"\",1)*1,Q75)>VLOOKUP($B75,'SeuilsComparaison-EMT'!$C$5:$J$24,4,FALSE),IF(ISTEXT(O75)=TRUE,SUBSTITUTE(O75,\"<\",\"\",1)*1,O75)>VLOOKUP($B75,'SeuilsComparaison-EMT'!$C$5:$J$24,4,FALSE)=TRUE),(IF(ISTEXT(O75)=TRUE,SUBSTITUTE(O75,\"<\",\"\",1)*1,O75)-((IF(ISTEXT(O75)=TRUE,SUBSTITUTE(O75,\"<\",\"\",1)*1,O75)+IF(ISTEXT(Q75)=TRUE,SUBSTITUTE(Q75,\"<\",\"\",1)*1,Q75))/2))/((IF(ISTEXT(O75)=TRUE,SUBSTITUTE(O75,\"<\",\"\",1)*1,O75)+IF(ISTEXT(Q75)=TRUE,SUBSTITUTE(Q75,\"<\",\"\",1),Q75))/2),\"-\")))","v":""},{"$f":"IF(OR(Q75=\"\",O75=\"\"),\"\",IF(AND(P75=\"Oui\",R75=\"Oui\"),\"Oui\",IF(S75=\"-\",\"Oui\",IF(OR(Q75>VLOOKUP($B75,'SeuilsComparaison-EMT'!$C$5:$J$24,4,FALSE),O75>VLOOKUP($B75,'SeuilsComparaison-EMT'!$C$5:$J$24,4,FALSE)=TRUE),IF(O75<=VLOOKUP($B75,'SeuilsComparaison-EMT'!$C$5:$J$24,5,FALSE),IF(ABS(S75)<=VLOOKUP($B75,'SeuilsComparaison-EMT'!$C$5:$J$24,6,FALSE),\"Oui\",\"Non\"),IF(ABS(S75)<=VLOOKUP($B75,'SeuilsComparaison-EMT'!$C$5:$J$24,8,FALSE),\"Oui\",\"Non\")),\"Oui\"))))","v":""}]
[null,"Ni",null,null,null,null,{"$f":"IF(OR(E76=\"\",C76=\"\"),\"\",IF(ISERROR(VLOOKUP($B76,'SeuilsComparaison-EMT'!$C$5:$J$24,4,FALSE)),\"-\",IF(OR(IF(ISTEXT(E76)=TRUE,SUBSTITUTE(E76,\"<\",\"\",1)*1,E76)>VLOOKUP($B76,'SeuilsComparaison-EMT'!$C$5:$J$24,4,FALSE),IF(ISTEXT(C76)=TRUE,SUBSTITUTE(C76,\"<\",\"\",1)*1,C76)>VLOOKUP($B76,'SeuilsComparaison-EMT'!$C$5:$J$24,4,FALSE)=TRUE),(IF(ISTEXT(C76)=TRUE,SUBSTITUTE(C76,\"<\",\"\",1)*1,C76)-((IF(ISTEXT(C76)=TRUE,SUBSTITUTE(C76,\"<\",\"\",1)*1,C76)+IF(ISTEXT(E76)=TRUE,SUBSTITUTE(E76,\"<\",\"\",1)*1,E76))/2))/((IF(ISTEXT(C76)=TRUE,SUBSTITUTE(C76,\"<\",\"\",1)*1,C76)+IF(ISTEXT(E76)=TRUE,SUBSTITUTE(E76,\"<\",\"\",1),E76))/2),\"-\")))","v":""},{"$f":"IF(OR(E76=\"\",C76=\"\"),\"\",IF(AND(D76=\"Oui\",F76=\"Oui\"),\"Oui\",IF(G76=\"-\",\"Oui\",IF(OR(E76>VLOOKUP($B76,'SeuilsComparaison-EMT'!$C$5:$J$24,4,FALSE),C76>VLOOKUP($B76,'SeuilsComparaison-EMT'!$C$5:$J$24,4,FALSE)=TRUE),IF(C76<=VLOOKUP($B76,'SeuilsComparaison-EMT'!$C$5:$J$24,5,FALSE),IF(ABS(G76)<=VLOOKUP($B76,'SeuilsComparaison-EMT'!$C$5:$J$24,6,FALSE),\"Oui\",\"Non\"),IF(ABS(G76)<=VLOOKUP($B76,'SeuilsComparaison-EMT'!$C$5:$J$24,8,FALSE),\"Oui\",\"Non\")),\"Oui\"))))","v":""},null,null,null,null,{"$f":"IF(OR(K76=\"\",I76=\"\"),\"\",IF(ISERROR(VLOOKUP($B76,'SeuilsComparaison-EMT'!$C$5:$J$24,4,FALSE)),\"-\",IF(OR(IF(ISTEXT(K76)=TRUE,SUBSTITUTE(K76,\"<\",\"\",1)*1,K76)>VLOOKUP($B76,'SeuilsComparaison-EMT'!$C$5:$J$24,4,FALSE),IF(ISTEXT(I76)=TRUE,SUBSTITUTE(I76,\"<\",\"\",1)*1,I76)>VLOOKUP($B76,'SeuilsComparaison-EMT'!$C$5:$J$24,4,FALSE)=TRUE),(IF(ISTEXT(I76)=TRUE,SUBSTITUTE(I76,\"<\",\"\",1)*1,I76)-((IF(ISTEXT(I76)=TRUE,SUBSTITUTE(I76,\"<\",\"\",1)*1,I76)+IF(ISTEXT(K76)=TRUE,SUBSTITUTE(K76,\"<\",\"\",1)*1,K76))/2))/((IF(ISTEXT(I76)=TRUE,SUBSTITUTE(I76,\"<\",\"\",1)*1,I76)+IF(ISTEXT(K76)=TRUE,SUBSTITUTE(K76,\"<\",\"\",1),K76))/2),\"-\")))","v":""},{"$f":"IF(OR(K76=\"\",I76=\"\"),\"\",IF(AND(J76=\"Oui\",L76=\"Oui\"),\"Oui\",IF(M76=\"-\",\"Oui\",IF(OR(K76>VLOOKUP($B76,'SeuilsComparaison-EMT'!$C$5:$J$24,4,FALSE),I76>VLOOKUP($B76,'SeuilsComparaison-EMT'!$C$5:$J$24,4,FALSE)=TRUE),IF(I76<=VLOOKUP($B76,'SeuilsComparaison-EMT'!$C$5:$J$24,5,FALSE),IF(ABS(M76)<=VLOOKUP($B76,'SeuilsComparaison-EMT'!$C$5:$J$24,6,FALSE),\"Oui\",\"Non\"),IF(ABS(M76)<=VLOOKUP($B76,'SeuilsComparaison-EMT'!$C$5:$J$24,8,FALSE),\"Oui\",\"Non\")),\"Oui\"))))","v":""},null,null,null,null,{"$f":"IF(OR(Q76=\"\",O76=\"\"),\"\",IF(ISERROR(VLOOKUP($B76,'SeuilsComparaison-EMT'!$C$5:$J$24,4,FALSE)),\"-\",IF(OR(IF(ISTEXT(Q76)=TRUE,SUBSTITUTE(Q76,\"<\",\"\",1)*1,Q76)>VLOOKUP($B76,'SeuilsComparaison-EMT'!$C$5:$J$24,4,FALSE),IF(ISTEXT(O76)=TRUE,SUBSTITUTE(O76,\"<\",\"\",1)*1,O76)>VLOOKUP($B76,'SeuilsComparaison-EMT'!$C$5:$J$24,4,FALSE)=TRUE),(IF(ISTEXT(O76)=TRUE,SUBSTITUTE(O76,\"<\",\"\",1)*1,O76)-((IF(ISTEXT(O76)=TRUE,SUBSTITUTE(O76,\"<\",\"\",1)*1,O76)+IF(ISTEXT(Q76)=TRUE,SUBSTITUTE(Q76,\"<\",\"\",1)*1,Q76))/2))/((IF(ISTEXT(O76)=TRUE,SUBSTITUTE(O76,\"<\",\"\",1)*1,O76)+IF(ISTEXT(Q76)=TRUE,SUBSTITUTE(Q76,\"<\",\"\",1),Q76))/2),\"-\")))","v":""},{"$f":"IF(OR(Q76=\"\",O76=\"\"),\"\",IF(AND(P76=\"Oui\",R76=\"Oui\"),\"Oui\",IF(S76=\"-\",\"Oui\",IF(OR(Q76>VLOOKUP($B76,'SeuilsComparaison-EMT'!$C$5:$J$24,4,FALSE),O76>VLOOKUP($B76,'SeuilsComparaison-EMT'!$C$5:$J$24,4,FALSE)=TRUE),IF(O76<=VLOOKUP($B76,'SeuilsComparaison-EMT'!$C$5:$J$24,5,FALSE),IF(ABS(S76)<=VLOOKUP($B76,'SeuilsComparaison-EMT'!$C$5:$J$24,6,FALSE),\"Oui\",\"Non\"),IF(ABS(S76)<=VLOOKUP($B76,'SeuilsComparaison-EMT'!$C$5:$J$24,8,FALSE),\"Oui\",\"Non\")),\"Oui\"))))","v":""}]
[null,"Pb",null,null,null,null,{"$f":"IF(OR(E77=\"\",C77=\"\"),\"\",IF(ISERROR(VLOOKUP($B77,'SeuilsComparaison-EMT'!$C$5:$J$24,4,FALSE)),\"-\",IF(OR(IF(ISTEXT(E77)=TRUE,SUBSTITUTE(E77,\"<\",\"\",1)*1,E77)>VLOOKUP($B77,'SeuilsComparaison-EMT'!$C$5:$J$24,4,FALSE),IF(ISTEXT(C77)=TRUE,SUBSTITUTE(C77,\"<\",\"\",1)*1,C77)>VLOOKUP($B77,'SeuilsComparaison-EMT'!$C$5:$J$24,4,FALSE)=TRUE),(IF(ISTEXT(C77)=TRUE,SUBSTITUTE(C77,\"<\",\"\",1)*1,C77)-((IF(ISTEXT(C77)=TRUE,SUBSTITUTE(C77,\"<\",\"\",1)*1,C77)+IF(ISTEXT(E77)=TRUE,SUBSTITUTE(E77,\"<\",\"\",1)*1,E77))/2))/((IF(ISTEXT(C77)=TRUE,SUBSTITUTE(C77,\"<\",\"\",1)*1,C77)+IF(ISTEXT(E77)=TRUE,SUBSTITUTE(E77,\"<\",\"\",1),E77))/2),\"-\")))","v":""},{"$f":"IF(OR(E77=\"\",C77=\"\"),\"\",IF(AND(D77=\"Oui\",F77=\"Oui\"),\"Oui\",IF(G77=\"-\",\"Oui\",IF(OR(E77>VLOOKUP($B77,'SeuilsComparaison-EMT'!$C$5:$J$24,4,FALSE),C77>VLOOKUP($B77,'SeuilsComparaison-EMT'!$C$5:$J$24,4,FALSE)=TRUE),IF(C77<=VLOOKUP($B77,'SeuilsComparaison-EMT'!$C$5:$J$24,5,FALSE),IF(ABS(G77)<=VLOOKUP($B77,'SeuilsComparaison-EMT'!$C$5:$J$24,6,FALSE),\"Oui\",\"Non\"),IF(ABS(G77)<=VLOOKUP($B77,'SeuilsComparaison-EMT'!$C$5:$J$24,8,FALSE),\"Oui\",\"Non\")),\"Oui\"))))","v":""},null,null,null,null,{"$f":"IF(OR(K77=\"\",I77=\"\"),\"\",IF(ISERROR(VLOOKUP($B77,'SeuilsComparaison-EMT'!$C$5:$J$24,4,FALSE)),\"-\",IF(OR(IF(ISTEXT(K77)=TRUE,SUBSTITUTE(K77,\"<\",\"\",1)*1,K77)>VLOOKUP($B77,'SeuilsComparaison-EMT'!$C$5:$J$24,4,FALSE),IF(ISTEXT(I77)=TRUE,SUBSTITUTE(I77,\"<\",\"\",1)*1,I77)>VLOOKUP($B77,'SeuilsComparaison-EMT'!$C$5:$J$24,4,FALSE)=TRUE),(IF(ISTEXT(I77)=TRUE,SUBSTITUTE(I77,\"<\",\"\",1)*1,I77)-((IF(ISTEXT(I77)=TRUE,SUBSTITUTE(I77,\"<\",\"\",1)*1,I77)+IF(ISTEXT(K77)=TRUE,SUBSTITUTE(K77,\"<\",\"\",1)*1,K77))/2))/((IF(ISTEXT(I77)=TRUE,SUBSTITUTE(I77,\"<\",\"\",1)*1,I77)+IF(ISTEXT(K77)=TRUE,SUBSTITUTE(K77,\"<\",\"\",1),K77))/2),\"-\")))","v":""},{"$f":"IF(OR(K77=\"\",I77=\"\"),\"\",IF(AND(J77=\"Oui\",L77=\"Oui\"),\"Oui\",IF(M77=\"-\",\"Oui\",IF(OR(K77>VLOOKUP($B77,'SeuilsComparaison-EMT'!$C$5:$J$24,4,FALSE),I77>VLOOKUP($B77,'SeuilsComparaison-EMT'!$C$5:$J$24,4,FALSE)=TRUE),IF(I77<=VLOOKUP($B77,'SeuilsComparaison-EMT'!$C$5:$J$24,5,FALSE),IF(ABS(M77)<=VLOOKUP($B77,'SeuilsComparaison-EMT'!$C$5:$J$24,6,FALSE),\"Oui\",\"Non\"),IF(ABS(M77)<=VLOOKUP($B77,'SeuilsComparaison-EMT'!$C$5:$J$24,8,FALSE),\"Oui\",\"Non\")),\"Oui\"))))","v":""},null,null,null,null,{"$f":"IF(OR(Q77=\"\",O77=\"\"),\"\",IF(ISERROR(VLOOKUP($B77,'SeuilsComparaison-EMT'!$C$5:$J$24,4,FALSE)),\"-\",IF(OR(IF(ISTEXT(Q77)=TRUE,SUBSTITUTE(Q77,\"<\",\"\",1)*1,Q77)>VLOOKUP($B77,'SeuilsComparaison-EMT'!$C$5:$J$24,4,FALSE),IF(ISTEXT(O77)=TRUE,SUBSTITUTE(O77,\"<\",\"\",1)*1,O77)>VLOOKUP($B77,'SeuilsComparaison-EMT'!$C$5:$J$24,4,FALSE)=TRUE),(IF(ISTEXT(O77)=TRUE,SUBSTITUTE(O77,\"<\",\"\",1)*1,O77)-((IF(ISTEXT(O77)=TRUE,SUBSTITUTE(O77,\"<\",\"\",1)*1,O77)+IF(ISTEXT(Q77)=TRUE,SUBSTITUTE(Q77,\"<\",\"\",1)*1,Q77))/2))/((IF(ISTEXT(O77)=TRUE,SUBSTITUTE(O77,\"<\",\"\",1)*1,O77)+IF(ISTEXT(Q77)=TRUE,SUBSTITUTE(Q77,\"<\",\"\",1),Q77))/2),\"-\")))","v":""},{"$f":"IF(OR(Q77=\"\",O77=\"\"),\"\",IF(AND(P77=\"Oui\",R77=\"Oui\"),\"Oui\",IF(S77=\"-\",\"Oui\",IF(OR(Q77>VLOOKUP($B77,'SeuilsComparaison-EMT'!$C$5:$J$24,4,FALSE),O77>VLOOKUP($B77,'SeuilsComparaison-EMT'!$C$5:$J$24,4,FALSE)=TRUE),IF(O77<=VLOOKUP($B77,'SeuilsComparaison-EMT'!$C$5:$J$24,5,FALSE),IF(ABS(S77)<=VLOOKUP($B77,'SeuilsComparaison-EMT'!$C$5:$J$24,6,FALSE),\"Oui\",\"Non\"),IF(ABS(S77)<=VLOOKUP($B77,'SeuilsComparaison-EMT'!$C$5:$J$24,8,FALSE),\"Oui\",\"Non\")),\"Oui\"))))","v":""}]
[null,"Zn",null,null,null,null,{"$f":"IF(OR(E78=\"\",C78=\"\"),\"\",IF(ISERROR(VLOOKUP($B78,'SeuilsComparaison-EMT'!$C$5:$J$24,4,FALSE)),\"-\",IF(OR(IF(ISTEXT(E78)=TRUE,SUBSTITUTE(E78,\"<\",\"\",1)*1,E78)>VLOOKUP($B78,'SeuilsComparaison-EMT'!$C$5:$J$24,4,FALSE),IF(ISTEXT(C78)=TRUE,SUBSTITUTE(C78,\"<\",\"\",1)*1,C78)>VLOOKUP($B78,'SeuilsComparaison-EMT'!$C$5:$J$24,4,FALSE)=TRUE),(IF(ISTEXT(C78)=TRUE,SUBSTITUTE(C78,\"<\",\"\",1)*1,C78)-((IF(ISTEXT(C78)=TRUE,SUBSTITUTE(C78,\"<\",\"\",1)*1,C78)+IF(ISTEXT(E78)=TRUE,SUBSTITUTE(E78,\"<\",\"\",1)*1,E78))/2))/((IF(ISTEXT(C78)=TRUE,SUBSTITUTE(C78,\"<\",\"\",1)*1,C78)+IF(ISTEXT(E78)=TRUE,SUBSTITUTE(E78,\"<\",\"\",1),E78))/2),\"-\")))","v":""},{"$f":"IF(OR(E78=\"\",C78=\"\"),\"\",IF(AND(D78=\"Oui\",F78=\"Oui\"),\"Oui\",IF(G78=\"-\",\"Oui\",IF(OR(E78>VLOOKUP($B78,'SeuilsComparaison-EMT'!$C$5:$J$24,4,FALSE),C78>VLOOKUP($B78,'SeuilsComparaison-EMT'!$C$5:$J$24,4,FALSE)=TRUE),IF(C78<=VLOOKUP($B78,'SeuilsComparaison-EMT'!$C$5:$J$24,5,FALSE),IF(ABS(G78)<=VLOOKUP($B78,'SeuilsComparaison-EMT'!$C$5:$J$24,6,FALSE),\"Oui\",\"Non\"),IF(ABS(G78)<=VLOOKUP($B78,'SeuilsComparaison-EMT'!$C$5:$J$24,8,FALSE),\"Oui\",\"Non\")),\"Oui\"))))","v":""},null,null,null,null,{"$f":"IF(OR(K78=\"\",I78=\"\"),\"\",IF(ISERROR(VLOOKUP($B78,'SeuilsComparaison-EMT'!$C$5:$J$24,4,FALSE)),\"-\",IF(OR(IF(ISTEXT(K78)=TRUE,SUBSTITUTE(K78,\"<\",\"\",1)*1,K78)>VLOOKUP($B78,'SeuilsComparaison-EMT'!$C$5:$J$24,4,FALSE),IF(ISTEXT(I78)=TRUE,SUBSTITUTE(I78,\"<\",\"\",1)*1,I78)>VLOOKUP($B78,'SeuilsComparaison-EMT'!$C$5:$J$24,4,FALSE)=TRUE),(IF(ISTEXT(I78)=TRUE,SUBSTITUTE(I78,\"<\",\"\",1)*1,I78)-((IF(ISTEXT(I78)=TRUE,SUBSTITUTE(I78,\"<\",\"\",1)*1,I78)+IF(ISTEXT(K78)=TRUE,SUBSTITUTE(K78,\"<\",\"\",1)*1,K78))/2))/((IF(ISTEXT(I78)=TRUE,SUBSTITUTE(I78,\"<\",\"\",1)*1,I78)+IF(ISTEXT(K78)=TRUE,SUBSTITUTE(K78,\"<\",\"\",1),K78))/2),\"-\")))","v":""},{"$f":"IF(OR(K78=\"\",I78=\"\"),\"\",IF(AND(J78=\"Oui\",L78=\"Oui\"),\"Oui\",IF(M78=\"-\",\"Oui\",IF(OR(K78>VLOOKUP($B78,'SeuilsComparaison-EMT'!$C$5:$J$24,4,FALSE),I78>VLOOKUP($B78,'SeuilsComparaison-EMT'!$C$5:$J$24,4,FALSE)=TRUE),IF(I78<=VLOOKUP($B78,'SeuilsComparaison-EMT'!$C$5:$J$24,5,FALSE),IF(ABS(M78)<=VLOOKUP($B78,'SeuilsComparaison-EMT'!$C$5:$J$24,6,FALSE),\"Oui\",\"Non\"),IF(ABS(M78)<=VLOOKUP($B78,'SeuilsComparaison-EMT'!$C$5:$J$24,8,FALSE),\"Oui\",\"Non\")),\"Oui\"))))","v":""},null,null,null,null,{"$f":"IF(OR(Q78=\"\",O78=\"\"),\"\",IF(ISERROR(VLOOKUP($B78,'SeuilsComparaison-EMT'!$C$5:$J$24,4,FALSE)),\"-\",IF(OR(IF(ISTEXT(Q78)=TRUE,SUBSTITUTE(Q78,\"<\",\"\",1)*1,Q78)>VLOOKUP($B78,'SeuilsComparaison-EMT'!$C$5:$J$24,4,FALSE),IF(ISTEXT(O78)=TRUE,SUBSTITUTE(O78,\"<\",\"\",1)*1,O78)>VLOOKUP($B78,'SeuilsComparaison-EMT'!$C$5:$J$24,4,FALSE)=TRUE),(IF(ISTEXT(O78)=TRUE,SUBSTITUTE(O78,\"<\",\"\",1)*1,O78)-((IF(ISTEXT(O78)=TRUE,SUBSTITUTE(O78,\"<\",\"\",1)*1,O78)+IF(ISTEXT(Q78)=TRUE,SUBSTITUTE(Q78,\"<\",\"\",1)*1,Q78))/2))/((IF(ISTEXT(O78)=TRUE,SUBSTITUTE(O78,\"<\",\"\",1)*1,O78)+IF(ISTEXT(Q78)=TRUE,SUBSTITUTE(Q78,\"<\",\"\",1),Q78))/2),\"-\")))","v":""},{"$f":"IF(OR(Q78=\"\",O78=\"\"),\"\",IF(AND(P78=\"Oui\",R78=\"Oui\"),\"Oui\",IF(S78=\"-\",\"Oui\",IF(OR(Q78>VLOOKUP($B78,'SeuilsComparaison-EMT'!$C$5:$J$24,4,FALSE),O78>VLOOKUP($B78,'SeuilsComparaison-EMT'!$C$5:$J$24,4,FALSE)=TRUE),IF(O78<=VLOOKUP($B78,'SeuilsComparaison-EMT'!$C$5:$J$24,5,FALSE),IF(ABS(S78)<=VLOOKUP($B78,'SeuilsComparaison-EMT'!$C$5:$J$24,6,FALSE),\"Oui\",\"Non\"),IF(ABS(S78)<=VLOOKUP($B78,'SeuilsComparaison-EMT'!$C$5:$J$24,8,FALSE),\"Oui\",\"Non\")),\"Oui\"))))","v":""}]
[null,"Conductivité",null,null,null,null,{"$f":"IF(OR(E79=\"\",C79=\"\"),\"\",IF(ISERROR(VLOOKUP($B79,'SeuilsComparaison-EMT'!$C$5:$J$24,4,FALSE)),\"-\",IF(OR(IF(ISTEXT(E79)=TRUE,SUBSTITUTE(E79,\"<\",\"\",1)*1,E79)>VLOOKUP($B79,'SeuilsComparaison-EMT'!$C$5:$J$24,4,FALSE),IF(ISTEXT(C79)=TRUE,SUBSTITUTE(C79,\"<\",\"\",1)*1,C79)>VLOOKUP($B79,'SeuilsComparaison-EMT'!$C$5:$J$24,4,FALSE)=TRUE),(IF(ISTEXT(C79)=TRUE,SUBSTITUTE(C79,\"<\",\"\",1)*1,C79)-((IF(ISTEXT(C79)=TRUE,SUBSTITUTE(C79,\"<\",\"\",1)*1,C79)+IF(ISTEXT(E79)=TRUE,SUBSTITUTE(E79,\"<\",\"\",1)*1,E79))/2))/((IF(ISTEXT(C79)=TRUE,SUBSTITUTE(C79,\"<\",\"\",1)*1,C79)+IF(ISTEXT(E79)=TRUE,SUBSTITUTE(E79,\"<\",\"\",1),E79))/2),\"-\")))","v":""},{"$f":"IF(OR(E79=\"\",C79=\"\"),\"\",IF(AND(D79=\"Oui\",F79=\"Oui\"),\"Oui\",IF(G79=\"-\",\"Oui\",IF(OR(E79>VLOOKUP($B79,'SeuilsComparaison-EMT'!$C$5:$J$24,4,FALSE),C79>VLOOKUP($B79,'SeuilsComparaison-EMT'!$C$5:$J$24,4,FALSE)=TRUE),IF(C79<=VLOOKUP($B79,'SeuilsComparaison-EMT'!$C$5:$J$24,5,FALSE),IF(ABS(G79)<=VLOOKUP($B79,'SeuilsComparaison-EMT'!$C$5:$J$24,6,FALSE),\"Oui\",\"Non\"),IF(ABS(G79)<=VLOOKUP($B79,'SeuilsComparaison-EMT'!$C$5:$J$24,8,FALSE),\"Oui\",\"Non\")),\"Oui\"))))","v":""},null,null,null,null,{"$f":"IF(OR(K79=\"\",I79=\"\"),\"\",IF(ISERROR(VLOOKUP($B79,'SeuilsComparaison-EMT'!$C$5:$J$24,4,FALSE)),\"-\",IF(OR(IF(ISTEXT(K79)=TRUE,SUBSTITUTE(K79,\"<\",\"\",1)*1,K79)>VLOOKUP($B79,'SeuilsComparaison-EMT'!$C$5:$J$24,4,FALSE),IF(ISTEXT(I79)=TRUE,SUBSTITUTE(I79,\"<\",\"\",1)*1,I79)>VLOOKUP($B79,'SeuilsComparaison-EMT'!$C$5:$J$24,4,FALSE)=TRUE),(IF(ISTEXT(I79)=TRUE,SUBSTITUTE(I79,\"<\",\"\",1)*1,I79)-((IF(ISTEXT(I79)=TRUE,SUBSTITUTE(I79,\"<\",\"\",1)*1,I79)+IF(ISTEXT(K79)=TRUE,SUBSTITUTE(K79,\"<\",\"\",1)*1,K79))/2))/((IF(ISTEXT(I79)=TRUE,SUBSTITUTE(I79,\"<\",\"\",1)*1,I79)+IF(ISTEXT(K79)=TRUE,SUBSTITUTE(K79,\"<\",\"\",1),K79))/2),\"-\")))","v":""},{"$f":"IF(OR(K79=\"\",I79=\"\"),\"\",IF(AND(J79=\"Oui\",L79=\"Oui\"),\"Oui\",IF(M79=\"-\",\"Oui\",IF(OR(K79>VLOOKUP($B79,'SeuilsComparaison-EMT'!$C$5:$J$24,4,FALSE),I79>VLOOKUP($B79,'SeuilsComparaison-EMT'!$C$5:$J$24,4,FALSE)=TRUE),IF(I79<=VLOOKUP($B79,'SeuilsComparaison-EMT'!$C$5:$J$24,5,FALSE),IF(ABS(M79)<=VLOOKUP($B79,'SeuilsComparaison-EMT'!$C$5:$J$24,6,FALSE),\"Oui\",\"Non\"),IF(ABS(M79)<=VLOOKUP($B79,'SeuilsComparaison-EMT'!$C$5:$J$24,8,FALSE),\"Oui\",\"Non\")),\"Oui\"))))","v":""},null,null,null,null,{"$f":"IF(OR(Q79=\"\",O79=\"\"),\"\",IF(ISERROR(VLOOKUP($B79,'SeuilsComparaison-EMT'!$C$5:$J$24,4,FALSE)),\"-\",IF(OR(IF(ISTEXT(Q79)=TRUE,SUBSTITUTE(Q79,\"<\",\"\",1)*1,Q79)>VLOOKUP($B79,'SeuilsComparaison-EMT'!$C$5:$J$24,4,FALSE),IF(ISTEXT(O79)=TRUE,SUBSTITUTE(O79,\"<\",\"\",1)*1,O79)>VLOOKUP($B79,'SeuilsComparaison-EMT'!$C$5:$J$24,4,FALSE)=TRUE),(IF(ISTEXT(O79)=TRUE,SUBSTITUTE(O79,\"<\",\"\",1)*1,O79)-((IF(ISTEXT(O79)=TRUE,SUBSTITUTE(O79,\"<\",\"\",1)*1,O79)+IF(ISTEXT(Q79)=TRUE,SUBSTITUTE(Q79,\"<\",\"\",1)*1,Q79))/2))/((IF(ISTEXT(O79)=TRUE,SUBSTITUTE(O79,\"<\",\"\",1)*1,O79)+IF(ISTEXT(Q79)=TRUE,SUBSTITUTE(Q79,\"<\",\"\",1),Q79))/2),\"-\")))","v":""},{"$f":"IF(OR(Q79=\"\",O79=\"\"),\"\",IF(AND(P79=\"Oui\",R79=\"Oui\"),\"Oui\",IF(S79=\"-\",\"Oui\",IF(OR(Q79>VLOOKUP($B79,'SeuilsComparaison-EMT'!$C$5:$J$24,4,FALSE),O79>VLOOKUP($B79,'SeuilsComparaison-EMT'!$C$5:$J$24,4,FALSE)=TRUE),IF(O79<=VLOOKUP($B79,'SeuilsComparaison-EMT'!$C$5:$J$24,5,FALSE),IF(ABS(S79)<=VLOOKUP($B79,'SeuilsComparaison-EMT'!$C$5:$J$24,6,FALSE),\"Oui\",\"Non\"),IF(ABS(S79)<=VLOOKUP($B79,'SeuilsComparaison-EMT'!$C$5:$J$24,8,FALSE),\"Oui\",\"Non\")),\"Oui\"))))","v":""}]
[null,"Cl",null,null,null,null,{"$f":"IF(OR(E80=\"\",C80=\"\"),\"\",IF(ISERROR(VLOOKUP($B80,'SeuilsComparaison-EMT'!$C$5:$J$24,4,FALSE)),\"-\",IF(OR(IF(ISTEXT(E80)=TRUE,SUBSTITUTE(E80,\"<\",\"\",1)*1,E80)>VLOOKUP($B80,'SeuilsComparaison-EMT'!$C$5:$J$24,4,FALSE),IF(ISTEXT(C80)=TRUE,SUBSTITUTE(C80,\"<\",\"\",1)*1,C80)>VLOOKUP($B80,'SeuilsComparaison-EMT'!$C$5:$J$24,4,FALSE)=TRUE),(IF(ISTEXT(C80)=TRUE,SUBSTITUTE(C80,\"<\",\"\",1)*1,C80)-((IF(ISTEXT(C80)=TRUE,SUBSTITUTE(C80,\"<\",\"\",1)*1,C80)+IF(ISTEXT(E80)=TRUE,SUBSTITUTE(E80,\"<\",\"\",1)*1,E80))/2))/((IF(ISTEXT(C80)=TRUE,SUBSTITUTE(C80,\"<\",\"\",1)*1,C80)+IF(ISTEXT(E80)=TRUE,SUBSTITUTE(E80,\"<\",\"\",1),E80))/2),\"-\")))","v":""},{"$f":"IF(OR(E80=\"\",C80=\"\"),\"\",IF(AND(D80=\"Oui\",F80=\"Oui\"),\"Oui\",IF(G80=\"-\",\"Oui\",IF(OR(E80>VLOOKUP($B80,'SeuilsComparaison-EMT'!$C$5:$J$24,4,FALSE),C80>VLOOKUP($B80,'SeuilsComparaison-EMT'!$C$5:$J$24,4,FALSE)=TRUE),IF(C80<=VLOOKUP($B80,'SeuilsComparaison-EMT'!$C$5:$J$24,5,FALSE),IF(ABS(G80)<=VLOOKUP($B80,'SeuilsComparaison-EMT'!$C$5:$J$24,6,FALSE),\"Oui\",\"Non\"),IF(ABS(G80)<=VLOOKUP($B80,'SeuilsComparaison-EMT'!$C$5:$J$24,8,FALSE),\"Oui\",\"Non\")),\"Oui\"))))","v":""},null,null,null,null,{"$f":"IF(OR(K80=\"\",I80=\"\"),\"\",IF(ISERROR(VLOOKUP($B80,'SeuilsComparaison-EMT'!$C$5:$J$24,4,FALSE)),\"-\",IF(OR(IF(ISTEXT(K80)=TRUE,SUBSTITUTE(K80,\"<\",\"\",1)*1,K80)>VLOOKUP($B80,'SeuilsComparaison-EMT'!$C$5:$J$24,4,FALSE),IF(ISTEXT(I80)=TRUE,SUBSTITUTE(I80,\"<\",\"\",1)*1,I80)>VLOOKUP($B80,'SeuilsComparaison-EMT'!$C$5:$J$24,4,FALSE)=TRUE),(IF(ISTEXT(I80)=TRUE,SUBSTITUTE(I80,\"<\",\"\",1)*1,I80)-((IF(ISTEXT(I80)=TRUE,SUBSTITUTE(I80,\"<\",\"\",1)*1,I80)+IF(ISTEXT(K80)=TRUE,SUBSTITUTE(K80,\"<\",\"\",1)*1,K80))/2))/((IF(ISTEXT(I80)=TRUE,SUBSTITUTE(I80,\"<\",\"\",1)*1,I80)+IF(ISTEXT(K80)=TRUE,SUBSTITUTE(K80,\"<\",\"\",1),K80))/2),\"-\")))","v":""},{"$f":"IF(OR(K80=\"\",I80=\"\"),\"\",IF(AND(J80=\"Oui\",L80=\"Oui\"),\"Oui\",IF(M80=\"-\",\"Oui\",IF(OR(K80>VLOOKUP($B80,'SeuilsComparaison-EMT'!$C$5:$J$24,4,FALSE),I80>VLOOKUP($B80,'SeuilsComparaison-EMT'!$C$5:$J$24,4,FALSE)=TRUE),IF(I80<=VLOOKUP($B80,'SeuilsComparaison-EMT'!$C$5:$J$24,5,FALSE),IF(ABS(M80)<=VLOOKUP($B80,'SeuilsComparaison-EMT'!$C$5:$J$24,6,FALSE),\"Oui\",\"Non\"),IF(ABS(M80)<=VLOOKUP($B80,'SeuilsComparaison-EMT'!$C$5:$J$24,8,FALSE),\"Oui\",\"Non\")),\"Oui\"))))","v":""},null,null,null,null,{"$f":"IF(OR(Q80=\"\",O80=\"\"),\"\",IF(ISERROR(VLOOKUP($B80,'SeuilsComparaison-EMT'!$C$5:$J$24,4,FALSE)),\"-\",IF(OR(IF(ISTEXT(Q80)=TRUE,SUBSTITUTE(Q80,\"<\",\"\",1)*1,Q80)>VLOOKUP($B80,'SeuilsComparaison-EMT'!$C$5:$J$24,4,FALSE),IF(ISTEXT(O80)=TRUE,SUBSTITUTE(O80,\"<\",\"\",1)*1,O80)>VLOOKUP($B80,'SeuilsComparaison-EMT'!$C$5:$J$24,4,FALSE)=TRUE),(IF(ISTEXT(O80)=TRUE,SUBSTITUTE(O80,\"<\",\"\",1)*1,O80)-((IF(ISTEXT(O80)=TRUE,SUBSTITUTE(O80,\"<\",\"\",1)*1,O80)+IF(ISTEXT(Q80)=TRUE,SUBSTITUTE(Q80,\"<\",\"\",1)*1,Q80))/2))/((IF(ISTEXT(O80)=TRUE,SUBSTITUTE(O80,\"<\",\"\",1)*1,O80)+IF(ISTEXT(Q80)=TRUE,SUBSTITUTE(Q80,\"<\",\"\",1),Q80))/2),\"-\")))","v":""},{"$f":"IF(OR(Q80=\"\",O80=\"\"),\"\",IF(AND(P80=\"Oui\",R80=\"Oui\"),\"Oui\",IF(S80=\"-\",\"Oui\",IF(OR(Q80>VLOOKUP($B80,'SeuilsComparaison-EMT'!$C$5:$J$24,4,FALSE),O80>VLOOKUP($B80,'SeuilsComparaison-EMT'!$C$5:$J$24,4,FALSE)=TRUE),IF(O80<=VLOOKUP($B80,'SeuilsComparaison-EMT'!$C$5:$J$24,5,FALSE),IF(ABS(S80)<=VLOOKUP($B80,'SeuilsComparaison-EMT'!$C$5:$J$24,6,FALSE),\"Oui\",\"Non\"),IF(ABS(S80)<=VLOOKUP($B80,'SeuilsComparaison-EMT'!$C$5:$J$24,8,FALSE),\"Oui\",\"Non\")),\"Oui\"))))","v":""}]
[null,null,null,null,null,null,{"$f":"IF(OR(E81=\"\",C81=\"\"),\"\",IF(ISERROR(VLOOKUP($B81,'SeuilsComparaison-EMT'!$C$5:$J$24,4,FALSE)),\"-\",IF(OR(IF(ISTEXT(E81)=TRUE,SUBSTITUTE(E81,\"<\",\"\",1)*1,E81)>VLOOKUP($B81,'SeuilsComparaison-EMT'!$C$5:$J$24,4,FALSE),IF(ISTEXT(C81)=TRUE,SUBSTITUTE(C81,\"<\",\"\",1)*1,C81)>VLOOKUP($B81,'SeuilsComparaison-EMT'!$C$5:$J$24,4,FALSE)=TRUE),(IF(ISTEXT(C81)=TRUE,SUBSTITUTE(C81,\"<\",\"\",1)*1,C81)-((IF(ISTEXT(C81)=TRUE,SUBSTITUTE(C81,\"<\",\"\",1)*1,C81)+IF(ISTEXT(E81)=TRUE,SUBSTITUTE(E81,\"<\",\"\",1)*1,E81))/2))/((IF(ISTEXT(C81)=TRUE,SUBSTITUTE(C81,\"<\",\"\",1)*1,C81)+IF(ISTEXT(E81)=TRUE,SUBSTITUTE(E81,\"<\",\"\",1),E81))/2),\"-\")))","v":""},{"$f":"IF(OR(E81=\"\",C81=\"\"),\"\",IF(AND(D81=\"Oui\",F81=\"Oui\"),\"Oui\",IF(G81=\"-\",\"Oui\",IF(OR(E81>VLOOKUP($B81,'SeuilsComparaison-EMT'!$C$5:$J$24,4,FALSE),C81>VLOOKUP($B81,'SeuilsComparaison-EMT'!$C$5:$J$24,4,FALSE)=TRUE),IF(C81<=VLOOKUP($B81,'SeuilsComparaison-EMT'!$C$5:$J$24,5,FALSE),IF(ABS(G81)<=VLOOKUP($B81,'SeuilsComparaison-EMT'!$C$5:$J$24,6,FALSE),\"Oui\",\"Non\"),IF(ABS(G81)<=VLOOKUP($B81,'SeuilsComparaison-EMT'!$C$5:$J$24,8,FALSE),\"Oui\",\"Non\")),\"Oui\"))))","v":""},null,null,null,null,{"$f":"IF(OR(K81=\"\",I81=\"\"),\"\",IF(ISERROR(VLOOKUP($B81,'SeuilsComparaison-EMT'!$C$5:$J$24,4,FALSE)),\"-\",IF(OR(IF(ISTEXT(K81)=TRUE,SUBSTITUTE(K81,\"<\",\"\",1)*1,K81)>VLOOKUP($B81,'SeuilsComparaison-EMT'!$C$5:$J$24,4,FALSE),IF(ISTEXT(I81)=TRUE,SUBSTITUTE(I81,\"<\",\"\",1)*1,I81)>VLOOKUP($B81,'SeuilsComparaison-EMT'!$C$5:$J$24,4,FALSE)=TRUE),(IF(ISTEXT(I81)=TRUE,SUBSTITUTE(I81,\"<\",\"\",1)*1,I81)-((IF(ISTEXT(I81)=TRUE,SUBSTITUTE(I81,\"<\",\"\",1)*1,I81)+IF(ISTEXT(K81)=TRUE,SUBSTITUTE(K81,\"<\",\"\",1)*1,K81))/2))/((IF(ISTEXT(I81)=TRUE,SUBSTITUTE(I81,\"<\",\"\",1)*1,I81)+IF(ISTEXT(K81)=TRUE,SUBSTITUTE(K81,\"<\",\"\",1),K81))/2),\"-\")))","v":""},{"$f":"IF(OR(K81=\"\",I81=\"\"),\"\",IF(AND(J81=\"Oui\",L81=\"Oui\"),\"Oui\",IF(M81=\"-\",\"Oui\",IF(OR(K81>VLOOKUP($B81,'SeuilsComparaison-EMT'!$C$5:$J$24,4,FALSE),I81>VLOOKUP($B81,'SeuilsComparaison-EMT'!$C$5:$J$24,4,FALSE)=TRUE),IF(I81<=VLOOKUP($B81,'SeuilsComparaison-EMT'!$C$5:$J$24,5,FALSE),IF(ABS(M81)<=VLOOKUP($B81,'SeuilsComparaison-EMT'!$C$5:$J$24,6,FALSE),\"Oui\",\"Non\"),IF(ABS(M81)<=VLOOKUP($B81,'SeuilsComparaison-EMT'!$C$5:$J$24,8,FALSE),\"Oui\",\"Non\")),\"Oui\"))))","v":""},null,null,null,null,{"$f":"IF(OR(Q81=\"\",O81=\"\"),\"\",IF(ISERROR(VLOOKUP($B81,'SeuilsComparaison-EMT'!$C$5:$J$24,4,FALSE)),\"-\",IF(OR(IF(ISTEXT(Q81)=TRUE,SUBSTITUTE(Q81,\"<\",\"\",1)*1,Q81)>VLOOKUP($B81,'SeuilsComparaison-EMT'!$C$5:$J$24,4,FALSE),IF(ISTEXT(O81)=TRUE,SUBSTITUTE(O81,\"<\",\"\",1)*1,O81)>VLOOKUP($B81,'SeuilsComparaison-EMT'!$C$5:$J$24,4,FALSE)=TRUE),(IF(ISTEXT(O81)=TRUE,SUBSTITUTE(O81,\"<\",\"\",1)*1,O81)-((IF(ISTEXT(O81)=TRUE,SUBSTITUTE(O81,\"<\",\"\",1)*1,O81)+IF(ISTEXT(Q81)=TRUE,SUBSTITUTE(Q81,\"<\",\"\",1)*1,Q81))/2))/((IF(ISTEXT(O81)=TRUE,SUBSTITUTE(O81,\"<\",\"\",1)*1,O81)+IF(ISTEXT(Q81)=TRUE,SUBSTITUTE(Q81,\"<\",\"\",1),Q81))/2),\"-\")))","v":""},{"$f":"IF(OR(Q81=\"\",O81=\"\"),\"\",IF(AND(P81=\"Oui\",R81=\"Oui\"),\"Oui\",IF(S81=\"-\",\"Oui\",IF(OR(Q81>VLOOKUP($B81,'SeuilsComparaison-EMT'!$C$5:$J$24,4,FALSE),O81>VLOOKUP($B81,'SeuilsComparaison-EMT'!$C$5:$J$24,4,FALSE)=TRUE),IF(O81<=VLOOKUP($B81,'SeuilsComparaison-EMT'!$C$5:$J$24,5,FALSE),IF(ABS(S81)<=VLOOKUP($B81,'SeuilsComparaison-EMT'!$C$5:$J$24,6,FALSE),\"Oui\",\"Non\"),IF(ABS(S81)<=VLOOKUP($B81,'SeuilsComparaison-EMT'!$C$5:$J$24,8,FALSE),\"Oui\",\"Non\")),\"Oui\"))))","v":""}]
[]
[null,"Identifier en jaune les résultats d'analyse produits par le laboratoire interne "]
[null,null,null,null,null,null,{"$f":"IF(OR(E84=\"\",C84=\"\"),\"\",IF(OR(IF(ISTEXT(E84)=TRUE,SUBSTITUTE(E84,\"<\",\"\",1)*1,E84)>VLOOKUP($B84,'SeuilsComparaison-EMT'!$C$5:$J$24,4,FALSE),IF(ISTEXT(C84)=TRUE,SUBSTITUTE(C84,\"<\",\"\",1)*1,C84)>VLOOKUP($B84,'SeuilsComparaison-EMT'!$C$5:$J$24,4,FALSE)=TRUE),(IF(ISTEXT(C84)=TRUE,SUBSTITUTE(C84,\"<\",\"\",1)*1,C84)-((IF(ISTEXT(C84)=TRUE,SUBSTITUTE(C84,\"<\",\"\",1)*1,C84)+IF(ISTEXT(E84)=TRUE,SUBSTITUTE(E84,\"<\",\"\",1)*1,E84))/2))/((IF(ISTEXT(C84)=TRUE,SUBSTITUTE(C84,\"<\",\"\",1)*1,C84)+IF(ISTEXT(E84)=TRUE,SUBSTITUTE(E84,\"<\",\"\",1),E84))/2),\"-\"))","v":""},{"$f":"IF(OR(E84=\"\",C84=\"\"),\"\",IF(AND(D84=\"Oui\",F84=\"Oui\"),\"Oui\",IF(G84=\"-\",\"-\",IF(OR(E84>VLOOKUP($B84,'SeuilsComparaison-EMT'!$C$5:$J$24,4,FALSE),C84>VLOOKUP($B84,'SeuilsComparaison-EMT'!$C$5:$J$24,4,FALSE)=TRUE),IF(C84<=VLOOKUP($B84,'SeuilsComparaison-EMT'!$C$5:$J$24,5,FALSE),IF(ABS(G84)<=VLOOKUP($B84,'SeuilsComparaison-EMT'!$C$5:$J$24,6,FALSE),\"Oui\",\"Non\"),IF(ABS(G84)<=VLOOKUP($B84,'SeuilsComparaison-EMT'!$C$5:$J$24,8,FALSE),\"Oui\",\"Non\")),\"Oui\"))))","v":""},null,null,null,null,{"$f":"IF(OR(K84=\"\",I84=\"\"),\"\",IF(OR(IF(ISTEXT(K84)=TRUE,SUBSTITUTE(K84,\"<\",\"\",1)*1,K84)>VLOOKUP($B84,'SeuilsComparaison-EMT'!$C$5:$J$24,4,FALSE),IF(ISTEXT(I84)=TRUE,SUBSTITUTE(I84,\"<\",\"\",1)*1,I84)>VLOOKUP($B84,'SeuilsComparaison-EMT'!$C$5:$J$24,4,FALSE)=TRUE),(IF(ISTEXT(I84)=TRUE,SUBSTITUTE(I84,\"<\",\"\",1)*1,I84)-((IF(ISTEXT(I84)=TRUE,SUBSTITUTE(I84,\"<\",\"\",1)*1,I84)+IF(ISTEXT(K84)=TRUE,SUBSTITUTE(K84,\"<\",\"\",1)*1,K84))/2))/((IF(ISTEXT(I84)=TRUE,SUBSTITUTE(I84,\"<\",\"\",1)*1,I84)+IF(ISTEXT(K84)=TRUE,SUBSTITUTE(K84,\"<\",\"\",1),K84))/2),\"-\"))","v":""},{"$f":"IF(OR(K84=\"\",I84=\"\"),\"\",IF(AND(J84=\"Oui\",L84=\"Oui\"),\"Oui\",IF(M84=\"-\",\"-\",IF(OR(K84>VLOOKUP($B84,'SeuilsComparaison-EMT'!$C$5:$J$24,4,FALSE),I84>VLOOKUP($B84,'SeuilsComparaison-EMT'!$C$5:$J$24,4,FALSE)=TRUE),IF(I84<=VLOOKUP($B84,'SeuilsComparaison-EMT'!$C$5:$J$24,5,FALSE),IF(ABS(M84)<=VLOOKUP($B84,'SeuilsComparaison-EMT'!$C$5:$J$24,6,FALSE),\"Oui\",\"Non\"),IF(ABS(M84)<=VLOOKUP($B84,'SeuilsComparaison-EMT'!$C$5:$J$24,8,FALSE),\"Oui\",\"Non\")),\"Oui\"))))","v":""},null,null,null,null,{"$f":"IF(OR(Q84=\"\",O84=\"\"),\"\",IF(OR(IF(ISTEXT(Q84)=TRUE,SUBSTITUTE(Q84,\"<\",\"\",1)*1,Q84)>VLOOKUP($B84,'SeuilsComparaison-EMT'!$C$5:$J$24,4,FALSE),IF(ISTEXT(O84)=TRUE,SUBSTITUTE(O84,\"<\",\"\",1)*1,O84)>VLOOKUP($B84,'SeuilsComparaison-EMT'!$C$5:$J$24,4,FALSE)=TRUE),(IF(ISTEXT(O84)=TRUE,SUBSTITUTE(O84,\"<\",\"\",1)*1,O84)-((IF(ISTEXT(O84)=TRUE,SUBSTITUTE(O84,\"<\",\"\",1)*1,O84)+IF(ISTEXT(Q84)=TRUE,SUBSTITUTE(Q84,\"<\",\"\",1)*1,Q84))/2))/((IF(ISTEXT(O84)=TRUE,SUBSTITUTE(O84,\"<\",\"\",1)*1,O84)+IF(ISTEXT(Q84)=TRUE,SUBSTITUTE(Q84,\"<\",\"\",1),Q84))/2),\"-\"))","v":""},{"$f":"IF(OR(Q84=\"\",O84=\"\"),\"\",IF(AND(P84=\"Oui\",R84=\"Oui\"),\"Oui\",IF(S84=\"-\",\"-\",IF(OR(Q84>VLOOKUP($B84,'SeuilsComparaison-EMT'!$C$5:$J$24,4,FALSE),O84>VLOOKUP($B84,'SeuilsComparaison-EMT'!$C$5:$J$24,4,FALSE)=TRUE),IF(O84<=VLOOKUP($B84,'SeuilsComparaison-EMT'!$C$5:$J$24,5,FALSE),IF(ABS(S84)<=VLOOKUP($B84,'SeuilsComparaison-EMT'!$C$5:$J$24,6,FALSE),\"Oui\",\"Non\"),IF(ABS(S84)<=VLOOKUP($B84,'SeuilsComparaison-EMT'!$C$5:$J$24,8,FALSE),\"Oui\",\"Non\")),\"Oui\"))))","v":""}]

{"sheet":"CVal","index":4,"n_rows":63,"n_cols":13,"rows_kept":63,"cut":false,"hidden":true,"merged":[[37,1,37,4],[37,9,37,12],[36,0,36,12],[2,2,2,4],[9,1,9,4],[9,9,9,12],[8,0,8,12],[9,5,9,8],[0,0,0,12],[3,11,3,12],[4,11,4,12],[3,0,3,2],[4,0,4,2]]}
["ETAT COMPARATIF ANALYTIQUE"]
[]
[null,"Contrôle effectué le","2003-06-25"]
["Organisme(s) de contrôle",null,null,"GUIGUES",null,null,null,null,null,null,"Date de réception des résultats d'analyses","2003-07-02"]
["Analyses station réalisées par",null,null,"Labo SEM",null,null,null,null,null,null,"Ecarts entre Date Analyses/Réception",{"$f":"L4-C3","v":7}]
[]
[]
[]
["Dénomination des points d'autosurveillance"]
[null,"Rejet COURLY",null,null,null,"REJET UF",null,null,null,"Envoi GEPEIF"]
["paramètres","Station\nOU Etabliss","Labo\n de contrôle.","Ecart","Conformité","Station\nOU Etabliss","Labo\n de contrôle.","Ecart","Conformité","Station\nOU Etabliss","Labo\n de contrôle.","Ecart","Conformité"]
["DBO5",{"$f":"IF(ISBLANK(AnalysesComparatives!C29),\"\",SUBSTITUTE(AnalysesComparatives!C29,\"<\",\"\")*1)","v":""},{"$f":"IF(ISBLANK(AnalysesComparatives!E29),\"\",SUBSTITUTE(AnalysesComparatives!E29,\"<\",\"\")*1)","v":""},{"$f":"IF(OR(C12=\"\",B12=\"\"),\"\",IF(AND(B12<=SC_DBO5,C12<=SC_DBO5),\"-\",(B12-AVERAGE(B12:C12))/AVERAGE(B12:C12)))","v":""},{"$f":"IF(D12=\"\",\"\",IF(D12=\"-\",\"oui\",IF(OR(AND(AVERAGE(B12:C12)>DBO5faible,ABS(D12)>3*EMT_DBO5_forte),AND(AVERAGE(B12:C12)<DBO5faible,ABS(D12)>3*EMT_DBO5_faible)),\"non\",IF(AND(B12<=SC_DBO5,C12<=SC_DBO5),\"oui\",IF(AND(AVERAGE(B12:C12)>DBO5faible,D12>=-EMT_DBO5_forte,D12<=EMT_DBO5_forte),\"oui\",IF(AND(AVERAGE(B12:C12)<=DBO5faible,D12>=-EMT_DBO5_faible,D12<=EMT_DBO5_faible),\"oui\",\"non\"))))))","v":""},{"$f":"IF(ISBLANK(AnalysesComparatives!I29),\"\",SUBSTITUTE(AnalysesComparatives!I29,\"<\",\"\")*1)","v":""},{"$f":"IF(ISBLANK(AnalysesComparatives!J29),\"\",SUBSTITUTE(AnalysesComparatives!J29,\"<\",\"\")*1)","v":""},{"$f":"IF(OR(G12=\"\",F12=\"\"),\"\",IF(AND(F12<=SC_DBO5,G12<=SC_DBO5),\"-\",(F12-AVERAGE(F12:G12))/AVERAGE(F12:G12)))","v":""},{"$f":"IF(H12=\"\",\"\",IF(H12=\"-\",\"oui\",IF(OR(AND(AVERAGE(F12:G12)>DBO5faible,ABS(H12)>3*EMT_DBO5_forte),AND(AVERAGE(F12:G12)<DBO5faible,ABS(H12)>3*EMT_DBO5_faible)),\"non\",IF(AND(F12<=SC_DBO5,G12<=SC_DBO5),\"oui\",IF(AND(AVERAGE(F12:G12)>DBO5faible,H12>=-EMT_DBO5_forte,H12<=EMT_DBO5_forte),\"oui\",IF(AND(AVERAGE(F12:G12)<=DBO5faible,H12>=-EMT_DBO5_faible,H12<=EMT_DBO5_faible),\"oui\",\"non\"))))))","v":""},{"$f":"IF(ISBLANK(AnalysesComparatives!M29),\"\",SUBSTITUTE(AnalysesComparatives!M29,\"<\",\"\")*1)","v":{"$error":"#VALUE!"}},{"$f":"IF(ISBLANK(AnalysesComparatives!N29),\"\",SUBSTITUTE(AnalysesComparatives!N29,\"<\",\"\")*1)","v":{"$error":"#VALUE!"}},{"$f":"IF(OR(K12=\"\",J12=\"\"),\"\",IF(AND(J12<=SC_DBO5,K12<=SC_DBO5),\"-\",(J12-AVERAGE(J12:K12))/AVERAGE(J12:K12)))","v":{"$error":"#VALUE!"}},{"$f":"IF(L12=\"\",\"\",IF(L12=\"-\",\"oui\",IF(OR(AND(AVERAGE(J12:K12)>DBO5faible,ABS(L12)>3*EMT_DBO5_forte),AND(AVERAGE(J12:K12)<DBO5faible,ABS(L12)>3*EMT_DBO5_faible)),\"non\",IF(AND(J12<=SC_DBO5,K12<=SC_DBO5),\"oui\",IF(AND(AVERAGE(J12:K12)>DBO5faible,L12>=-EMT_DBO5_forte,L12<=EMT_DBO5_forte),\"oui\",IF(AND(AVERAGE(J12:K12)<=DBO5faible,L12>=-EMT_DBO5_faible,L12<=EMT_DBO5_faible),\"oui\",\"non\"))))))","v":{"$error":"#VALUE!"}}]
["DCO",{"$f":"IF(ISBLANK(AnalysesComparatives!C31),\"\",SUBSTITUTE(AnalysesComparatives!C31,\"<\",\"\")*1)","v":""},{"$f":"IF(ISBLANK(AnalysesComparatives!E31),\"\",SUBSTITUTE(AnalysesComparatives!E31,\"<\",\"\")*1)","v":""},{"$f":"IF(OR(C13=\"\",B13=\"\"),\"\",IF(AND(B13<=SC_DCO,C13<=SC_DCO),\"-\",(B13-AVERAGE(B13:C13))/AVERAGE(B13:C13)))","v":""},{"$f":"IF(D13=\"\",\"\",IF(D13=\"-\",\"oui\",IF(OR(AND(AVERAGE(B13:C13)>DCOfaible,ABS(D13)>3*EMT_DCO_forte),AND(AVERAGE(B13:C13)<DCOfaible,ABS(D13)>3*EMT_DCO_faible)),\"non\",IF(AND(B13<=SC_DCO,C13<=SC_DCO),\"oui\",IF(AND(AVERAGE(B13:C13)>DCOfaible,D13>=-EMT_DCO_forte,D13<=EMT_DCO_forte),\"oui\",IF(AND(AVERAGE(B13:C13)<=DCOfaible,D13>=-EMT_DCO_faible,D13<=EMT_DCO_faible),\"oui\",\"non\"))))))","v":""},{"$f":"IF(ISBLANK(AnalysesComparatives!I31),\"\",SUBSTITUTE(AnalysesComparatives!I31,\"<\",\"\")*1)","v":""},{"$f":"IF(ISBLANK(AnalysesComparatives!J31),\"\",SUBSTITUTE(AnalysesComparatives!J31,\"<\",\"\")*1)","v":""},{"$f":"IF(OR(G13=\"\",F13=\"\"),\"\",IF(AND(F13<=SC_DCO,G13<=SC_DCO),\"-\",(F13-AVERAGE(F13:G13))/AVERAGE(F13:G13)))","v":""},{"$f":"IF(H13=\"\",\"\",IF(H13=\"-\",\"oui\",IF(OR(AND(AVERAGE(F13:G13)>DCOfaible,ABS(H13)>3*EMT_DCO_forte),AND(AVERAGE(F13:G13)<DCOfaible,ABS(H13)>3*EMT_DCO_faible)),\"non\",IF(AND(F13<=SC_DCO,G13<=SC_DCO),\"oui\",IF(AND(AVERAGE(F13:G13)>DCOfaible,H13>=-EMT_DCO_forte,H13<=EMT_DCO_forte),\"oui\",IF(AND(AVERAGE(F13:G13)<=DCOfaible,H13>=-EMT_DCO_faible,H13<=EMT_DCO_faible),\"oui\",\"non\"))))))","v":""},{"$f":"IF(ISBLANK(AnalysesComparatives!M31),\"\",SUBSTITUTE(AnalysesComparatives!M31,\"<\",\"\")*1)","v":{"$error":"#VALUE!"}},{"$f":"IF(ISBLANK(AnalysesComparatives!N31),\"\",SUBSTITUTE(AnalysesComparatives!N31,\"<\",\"\")*1)","v":{"$error":"#VALUE!"}},{"$f":"IF(OR(K13=\"\",J13=\"\"),\"\",IF(AND(J13<=SC_DCO,K13<=SC_DCO),\"-\",(J13-AVERAGE(J13:K13))/AVERAGE(J13:K13)))","v":{"$error":"#VALUE!"}},{"$f":"IF(L13=\"\",\"\",IF(L13=\"-\",\"oui\",IF(OR(AND(AVERAGE(J13:K13)>DCOfaible,ABS(L13)>3*EMT_DCO_forte),AND(AVERAGE(J13:K13)<DCOfaible,ABS(L13)>3*EMT_DCO_faible)),\"non\",IF(AND(J13<=SC_DCO,K13<=SC_DCO),\"oui\",IF(AND(AVERAGE(J13:K13)>DCOfaible,L13>=-EMT_DCO_forte,L13<=EMT_DCO_forte),\"oui\",IF(AND(AVERAGE(J13:K13)<=DCOfaible,L13>=-EMT_DCO_faible,L13<=EMT_DCO_faible),\"oui\",\"non\"))))))","v":{"$error":"#VALUE!"}}]
["MES",{"$f":"IF(ISBLANK(AnalysesComparatives!C33),\"\",SUBSTITUTE(AnalysesComparatives!C33,\"<\",\"\")*1)","v":""},{"$f":"IF(ISBLANK(AnalysesComparatives!E33),\"\",SUBSTITUTE(AnalysesComparatives!E33,\"<\",\"\")*1)","v":""},{"$f":"IF(OR(C14=\"\",B14=\"\"),\"\",IF(AND(B14<=SC_MEST,C14<=SC_MEST),\"-\",(B14-AVERAGE(B14:C14))/AVERAGE(B14:C14)))","v":""},{"$f":"IF(D14=\"\",\"\",IF(D14=\"-\",\"oui\",IF(OR(AND(AVERAGE(B14:C14)>MESTfaible,ABS(D14)>3*EMT_MEST_forte),AND(AVERAGE(B14:C14)<MESTfaible,ABS(D14)>3*EMT_MEST_faible)),\"non\",IF(AND(B14<=SC_MEST,C14<=SC_MEST),\"oui\",IF(AND(AVERAGE(B14:C14)>MESTfaible,D14>=-EMT_MEST_forte,D14<=EMT_MEST_forte),\"oui\",IF(AND(AVERAGE(B14:C14)<=MESTfaible,D14>=-EMT_MEST_faible,D14<=EMT_MEST_faible),\"oui\",\"non\"))))))","v":""},{"$f":"IF(ISBLANK(AnalysesComparatives!I33),\"\",SUBSTITUTE(AnalysesComparatives!I33,\"<\",\"\")*1)","v":""},{"$f":"IF(ISBLANK(AnalysesComparatives!J33),\"\",SUBSTITUTE(AnalysesComparatives!J33,\"<\",\"\")*1)","v":""},{"$f":"IF(OR(G14=\"\",F14=\"\"),\"\",IF(AND(F14<=SC_MEST,G14<=SC_MEST),\"-\",(F14-AVERAGE(F14:G14))/AVERAGE(F14:G14)))","v":""},{"$f":"IF(H14=\"\",\"\",IF(H14=\"-\",\"oui\",IF(OR(AND(AVERAGE(F14:G14)>MESTfaible,ABS(H14)>3*EMT_MEST_forte),AND(AVERAGE(F14:G14)<MESTfaible,ABS(H14)>3*EMT_MEST_faible)),\"non\",IF(AND(F14<=SC_MEST,G14<=SC_MEST),\"oui\",IF(AND(AVERAGE(F14:G14)>MESTfaible,H14>=-EMT_MEST_forte,H14<=EMT_MEST_forte),\"oui\",IF(AND(AVERAGE(F14:G14)<=MESTfaible,H14>=-EMT_MEST_faible,H14<=EMT_MEST_faible),\"oui\",\"non\"))))))","v":""},{"$f":"IF(ISBLANK(AnalysesComparatives!M33),\"\",SUBSTITUTE(AnalysesComparatives!M33,\"<\",\"\")*1)","v":{"$error":"#VALUE!"}},{"$f":"IF(ISBLANK(AnalysesComparatives!N33),\"\",SUBSTITUTE(AnalysesComparatives!N33,\"<\",\"\")*1)","v":{"$error":"#VALUE!"}},{"$f":"IF(OR(K14=\"\",J14=\"\"),\"\",IF(AND(J14<=SC_MEST,K14<=SC_MEST),\"-\",(J14-AVERAGE(J14:K14))/AVERAGE(J14:K14)))","v":{"$error":"#VALUE!"}},{"$f":"IF(L14=\"\",\"\",IF(L14=\"-\",\"oui\",IF(OR(AND(AVERAGE(J14:K14)>MESTfaible,ABS(L14)>3*EMT_MEST_forte),AND(AVERAGE(J14:K14)<MESTfaible,ABS(L14)>3*EMT_MEST_faible)),\"non\",IF(AND(J14<=SC_MEST,K14<=SC_MEST),\"oui\",IF(AND(AVERAGE(J14:K14)>MESTfaible,L14>=-EMT_MEST_forte,L14<=EMT_MEST_forte),\"oui\",IF(AND(AVERAGE(J14:K14)<=MESTfaible,L14>=-EMT_MEST_faible,L14<=EMT_MEST_faible),\"oui\",\"non\"))))))","v":{"$error":"#VALUE!"}}]
["Nk",{"$f":"IF(ISBLANK(AnalysesComparatives!C34),\"\",SUBSTITUTE(AnalysesComparatives!C34,\"<\",\"\")*1)","v":""},{"$f":"IF(ISBLANK(AnalysesComparatives!E34),\"\",SUBSTITUTE(AnalysesComparatives!E34,\"<\",\"\")*1)","v":""},{"$f":"IF(OR(C15=\"\",B15=\"\"),\"\",IF(AND(B15<=SC_Nk,C15<=SC_Nk),\"-\",(B15-AVERAGE(B15:C15))/AVERAGE(B15:C15)))","v":""},{"$f":"IF(D15=\"\",\"\",IF(D15=\"-\",\"oui\",IF(OR(AND(AVERAGE(B15:C15)>Nkfaible,ABS(D15)>3*EMT_Nk_forte),AND(AVERAGE(B15:C15)<Nkfaible,ABS(D15)>3*EMT_Nk_faible)),\"non\",IF(AND(B15<=SC_Nk,C15<=SC_Nk),\"non\",IF(AND(AVERAGE(B15:C15)>Nkfaible,D15>=-EMT_Nk_forte,D15<=EMT_Nk_forte),\"oui\",IF(AND(AVERAGE(B15:C15)<=Nkfaible,D15>=-EMT_Nk_faible,D15<=EMT_Nk_faible),\"oui\",\"non\"))))))","v":""},{"$f":"IF(ISBLANK(AnalysesComparatives!I34),\"\",SUBSTITUTE(AnalysesComparatives!I34,\"<\",\"\")*1)","v":""},{"$f":"IF(ISBLANK(AnalysesComparatives!J34),\"\",SUBSTITUTE(AnalysesComparatives!J34,\"<\",\"\")*1)","v":""},{"$f":"IF(OR(G15=\"\",F15=\"\"),\"\",IF(AND(F15<=SC_Nk,G15<=SC_Nk),\"-\",(F15-AVERAGE(F15:G15))/AVERAGE(F15:G15)))","v":""},{"$f":"IF(H15=\"\",\"\",IF(H15=\"-\",\"oui\",IF(OR(AND(AVERAGE(F15:G15)>Nkfaible,ABS(H15)>3*EMT_Nk_forte),AND(AVERAGE(F15:G15)<Nkfaible,ABS(H15)>3*EMT_Nk_faible)),\"non\",IF(AND(F15<=SC_Nk,G15<=SC_Nk),\"non\",IF(AND(AVERAGE(F15:G15)>Nkfaible,H15>=-EMT_Nk_forte,H15<=EMT_Nk_forte),\"oui\",IF(AND(AVERAGE(F15:G15)<=Nkfaible,H15>=-EMT_Nk_faible,H15<=EMT_Nk_faible),\"oui\",\"non\"))))))","v":""},{"$f":"IF(ISBLANK(AnalysesComparatives!M34),\"\",SUBSTITUTE(AnalysesComparatives!M34,\"<\",\"\")*1)","v":{"$error":"#VALUE!"}},{"$f":"IF(ISBLANK(AnalysesComparatives!N34),\"\",SUBSTITUTE(AnalysesComparatives!N34,\"<\",\"\")*1)","v":{"$error":"#VALUE!"}},{"$f":"IF(OR(K15=\"\",J15=\"\"),\"\",IF(AND(J15<=SC_Nk,K15<=SC_Nk),\"-\",(J15-AVERAGE(J15:K15))/AVERAGE(J15:K15)))","v":{"$error":"#VALUE!"}},{"$f":"IF(L15=\"\",\"\",IF(L15=\"-\",\"oui\",IF(OR(AND(AVERAGE(J15:K15)>Nkfaible,ABS(L15)>3*EMT_Nk_forte),AND(AVERAGE(J15:K15)<Nkfaible,ABS(L15)>3*EMT_Nk_faible)),\"non\",IF(AND(J15<=SC_Nk,K15<=SC_Nk),\"non\",IF(AND(AVERAGE(J15:K15)>Nkfaible,L15>=-EMT_Nk_forte,L15<=EMT_Nk_forte),\"oui\",IF(AND(AVERAGE(J15:K15)<=Nkfaible,L15>=-EMT_Nk_faible,L15<=EMT_Nk_faible),\"oui\",\"non\"))))))","v":{"$error":"#VALUE!"}}]
["NH4",{"$f":"IF(ISBLANK(AnalysesComparatives!C35),\"\",SUBSTITUTE(AnalysesComparatives!C35,\"<\",\"\")*1)","v":""},{"$f":"IF(ISBLANK(AnalysesComparatives!E35),\"\",SUBSTITUTE(AnalysesComparatives!E35,\"<\",\"\")*1)","v":""},{"$f":"IF(OR(C16=\"\",B16=\"\"),\"\",IF(AND(B16<=SC_NH4,C16<=SC_NH4),\"-\",(B16-AVERAGE(B16:C16))/AVERAGE(B16:C16)))","v":""},{"$f":"IF(D16=\"\",\"\",IF(D16=\"-\",\"oui\",IF(OR(AND(AVERAGE(B16:C16)>NH4faible,ABS(D16)>3*EMT_NH4_forte),AND(AVERAGE(B16:C16)<NH4faible,ABS(D16)>3*EMT_NH4_faible)),\"non\",IF(AND(B16<=SC_NH4,C16<=SC_NH4),\"oui\",IF(AND(AVERAGE(B16:C16)>NH4faible,D16>=-EMT_NH4_forte,D16<=EMT_NH4_forte),\"oui\",IF(AND(AVERAGE(B16:C16)<=NH4faible,D16>=-EMT_NH4_faible,D16<=EMT_NH4_faible),\"oui\",\"non\"))))))","v":""},{"$f":"IF(ISBLANK(AnalysesComparatives!I35),\"\",SUBSTITUTE(AnalysesComparatives!I35,\"<\",\"\")*1)","v":""},{"$f":"IF(ISBLANK(AnalysesComparatives!J35),\"\",SUBSTITUTE(AnalysesComparatives!J35,\"<\",\"\")*1)","v":""},{"$f":"IF(OR(G16=\"\",F16=\"\"),\"\",IF(AND(F16<=SC_NH4,G16<=SC_NH4),\"-\",(F16-AVERAGE(F16:G16))/AVERAGE(F16:G16)))","v":""},{"$f":"IF(H16=\"\",\"\",IF(H16=\"-\",\"oui\",IF(OR(AND(AVERAGE(F16:G16)>NH4faible,ABS(H16)>3*EMT_NH4_forte),AND(AVERAGE(F16:G16)<NH4faible,ABS(H16)>3*EMT_NH4_faible)),\"non\",IF(AND(F16<=SC_NH4,G16<=SC_NH4),\"oui\",IF(AND(AVERAGE(F16:G16)>NH4faible,H16>=-EMT_NH4_forte,H16<=EMT_NH4_forte),\"oui\",IF(AND(AVERAGE(F16:G16)<=NH4faible,H16>=-EMT_NH4_faible,H16<=EMT_NH4_faible),\"oui\",\"non\"))))))","v":""},{"$f":"IF(ISBLANK(AnalysesComparatives!M35),\"\",SUBSTITUTE(AnalysesComparatives!M35,\"<\",\"\")*1)","v":{"$error":"#VALUE!"}},{"$f":"IF(ISBLANK(AnalysesComparatives!N35),\"\",SUBSTITUTE(AnalysesComparatives!N35,\"<\",\"\")*1)","v":{"$error":"#VALUE!"}},{"$f":"IF(OR(K16=\"\",J16=\"\"),\"\",IF(AND(J16<=SC_NH4,K16<=SC_NH4),\"-\",(J16-AVERAGE(J16:K16))/AVERAGE(J16:K16)))","v":{"$error":"#VALUE!"}},{"$f":"IF(L16=\"\",\"\",IF(L16=\"-\",\"oui\",IF(OR(AND(AVERAGE(J16:K16)>NH4faible,ABS(L16)>3*EMT_NH4_forte),AND(AVERAGE(J16:K16)<NH4faible,ABS(L16)>3*EMT_NH4_faible)),\"non\",IF(AND(J16<=SC_NH4,K16<=SC_NH4),\"oui\",IF(AND(AVERAGE(J16:K16)>NH4faible,L16>=-EMT_NH4_forte,L16<=EMT_NH4_forte),\"oui\",IF(AND(AVERAGE(J16:K16)<=NH4faible,L16>=-EMT_NH4_faible,L16<=EMT_NH4_faible),\"oui\",\"non\"))))))","v":{"$error":"#VALUE!"}}]
["NO2",{"$f":"IF(ISBLANK(AnalysesComparatives!C36),\"\",SUBSTITUTE(AnalysesComparatives!C36,\"<\",\"\")*1)","v":""},{"$f":"IF(ISBLANK(AnalysesComparatives!E36),\"\",SUBSTITUTE(AnalysesComparatives!E36,\"<\",\"\")*1)","v":""},{"$f":"IF(OR(C17=\"\",B17=\"\"),\"\",IF(AND(B17<=SC_NO2,C17<=SC_NO2),\"-\",(B17-AVERAGE(B17:C17))/AVERAGE(B17:C17)))","v":""},{"$f":"IF(D17=\"\",\"\",IF(D17=\"-\",\"oui\",IF(OR(AND(AVERAGE(B17:C17)>NO2faible,ABS(D17)>3*EMT_NO2_forte),AND(AVERAGE(B17:C17)<NO2faible,ABS(D17)>3*EMT_NO2_faible)),\"non\",IF(AND(B17<=SC_NO2,C17<=SC_NO2),\"oui\",IF(AND(AVERAGE(B17:C17)>NO2faible,D17>=-EMT_NO2_forte,D17<=EMT_NO2_forte),\"oui\",IF(AND(AVERAGE(B17:C17)<=NO2faible,D17>=-EMT_NO2_faible,D17<=EMT_NO2_faible),\"oui\",\"non\"))))))","v":""},{"$f":"IF(ISBLANK(AnalysesComparatives!I36),\"\",SUBSTITUTE(AnalysesComparatives!I36,\"<\",\"\")*1)","v":""},{"$f":"IF(ISBLANK(AnalysesComparatives!J36),\"\",SUBSTITUTE(AnalysesComparatives!J36,\"<\",\"\")*1)","v":""},{"$f":"IF(OR(G17=\"\",F17=\"\"),\"\",IF(AND(F17<=SC_NO2,G17<=SC_NO2),\"-\",(F17-AVERAGE(F17:G17))/AVERAGE(F17:G17)))","v":""},{"$f":"IF(H17=\"\",\"\",IF(H17=\"-\",\"oui\",IF(OR(AND(AVERAGE(F17:G17)>NO2faible,ABS(H17)>3*EMT_NO2_forte),AND(AVERAGE(F17:G17)<NO2faible,ABS(H17)>3*EMT_NO2_faible)),\"non\",IF(AND(F17<=SC_NO2,G17<=SC_NO2),\"oui\",IF(AND(AVERAGE(F17:G17)>NO2faible,H17>=-EMT_NO2_forte,H17<=EMT_NO2_forte),\"oui\",IF(AND(AVERAGE(F17:G17)<=NO2faible,H17>=-EMT_NO2_faible,H17<=EMT_NO2_faible),\"oui\",\"non\"))))))","v":""},{"$f":"IF(ISBLANK(AnalysesComparatives!M36),\"\",SUBSTITUTE(AnalysesComparatives!M36,\"<\",\"\")*1)","v":{"$error":"#VALUE!"}},{"$f":"IF(ISBLANK(AnalysesComparatives!N36),\"\",SUBSTITUTE(AnalysesComparatives!N36,\"<\",\"\")*1)","v":{"$error":"#VALUE!"}},{"$f":"IF(OR(K17=\"\",J17=\"\"),\"\",IF(AND(J17<=SC_NO2,K17<=SC_NO2),\"-\",(J17-AVERAGE(J17:K17))/AVERAGE(J17:K17)))","v":{"$error":"#VALUE!"}},{"$f":"IF(L17=\"\",\"\",IF(L17=\"-\",\"oui\",IF(OR(AND(AVERAGE(J17:K17)>NO2faible,ABS(L17)>3*EMT_NO2_forte),AND(AVERAGE(J17:K17)<NO2faible,ABS(L17)>3*EMT_NO2_faible)),\"non\",IF(AND(J17<=SC_NO2,K17<=SC_NO2),\"oui\",IF(AND(AVERAGE(J17:K17)>NO2faible,L17>=-EMT_NO2_forte,L17<=EMT_NO2_forte),\"oui\",IF(AND(AVERAGE(J17:K17)<=NO2faible,L17>=-EMT_NO2_faible,L17<=EMT_NO2_faible),\"oui\",\"non\"))))))","v":{"$error":"#VALUE!"}}]
["NO3",{"$f":"IF(ISBLANK(AnalysesComparatives!C37),\"\",SUBSTITUTE(AnalysesComparatives!C37,\"<\",\"\")*1)","v":""},{"$f":"IF(ISBLANK(AnalysesComparatives!E37),\"\",SUBSTITUTE(AnalysesComparatives!E37,\"<\",\"\")*1)","v":""},{"$f":"IF(OR(C18=\"\",B18=\"\"),\"\",IF(AND(B18<=SC_NO3,C18<=SC_NO3),\"-\",(B18-AVERAGE(B18:C18))/AVERAGE(B18:C18)))","v":""},{"$f":"IF(D18=\"\",\"\",IF(D18=\"-\",\"oui\",IF(OR(AND(AVERAGE(B18:C18)>NO3faible,ABS(D18)>3*EMT_NO3_forte),AND(AVERAGE(B18:C18)<NO3faible,ABS(D18)>3*EMT_NO3_faible)),\"non\",IF(AND(B18<=SC_NO3,C18<=SC_NO3),\"oui\",IF(AND(AVERAGE(B18:C18)>NO3faible,D18>=-EMT_NO3_forte,D18<=EMT_NO3_forte),\"oui\",IF(AND(AVERAGE(B18:C18)<=NO3faible,D18>=-EMT_NO3_faible,D18<=EMT_NO3_faible),\"oui\",\"non\"))))))","v":""},{"$f":"IF(ISBLANK(AnalysesComparatives!I37),\"\",SUBSTITUTE(AnalysesComparatives!I37,\"<\",\"\")*1)","v":""},{"$f":"IF(ISBLANK(AnalysesComparatives!J37),\"\",SUBSTITUTE(AnalysesComparatives!J37,\"<\",\"\")*1)","v":""},{"$f":"IF(OR(G18=\"\",F18=\"\"),\"\",IF(AND(F18<=SC_NO3,G18<=SC_NO3),\"-\",(F18-AVERAGE(F18:G18))/AVERAGE(F18:G18)))","v":""},{"$f":"IF(H18=\"\",\"\",IF(H18=\"-\",\"oui\",IF(OR(AND(AVERAGE(F18:G18)>NO3faible,ABS(H18)>3*EMT_NO3_forte),AND(AVERAGE(F18:G18)<NO3faible,ABS(H18)>3*EMT_NO3_faible)),\"non\",IF(AND(F18<=SC_NO3,G18<=SC_NO3),\"oui\",IF(AND(AVERAGE(F18:G18)>NO3faible,H18>=-EMT_NO3_forte,H18<=EMT_NO3_forte),\"oui\",IF(AND(AVERAGE(F18:G18)<=NO3faible,H18>=-EMT_NO3_faible,H18<=EMT_NO3_faible),\"oui\",\"non\"))))))","v":""},{"$f":"IF(ISBLANK(AnalysesComparatives!M37),\"\",SUBSTITUTE(AnalysesComparatives!M37,\"<\",\"\")*1)","v":{"$error":"#VALUE!"}},{"$f":"IF(ISBLANK(AnalysesComparatives!N37),\"\",SUBSTITUTE(AnalysesComparatives!N37,\"<\",\"\")*1)","v":{"$error":"#VALUE!"}},{"$f":"IF(OR(K18=\"\",J18=\"\"),\"\",IF(AND(J18<=SC_NO3,K18<=SC_NO3),\"-\",(J18-AVERAGE(J18:K18))/AVERAGE(J18:K18)))","v":{"$error":"#VALUE!"}},{"$f":"IF(L18=\"\",\"\",IF(L18=\"-\",\"oui\",IF(OR(AND(AVERAGE(J18:K18)>NO3faible,ABS(L18)>3*EMT_NO3_forte),AND(AVERAGE(J18:K18)<NO3faible,ABS(L18)>3*EMT_NO3_faible)),\"non\",IF(AND(J18<=SC_NO3,K18<=SC_NO3),\"oui\",IF(AND(AVERAGE(J18:K18)>NO3faible,L18>=-EMT_NO3_forte,L18<=EMT_NO3_forte),\"oui\",IF(AND(AVERAGE(J18:K18)<=NO3faible,L18>=-EMT_NO3_faible,L18<=EMT_NO3_faible),\"oui\",\"non\"))))))","v":{"$error":"#VALUE!"}}]
["Azote Global",{"$f":"IF(ISBLANK(AnalysesComparatives!C38),\"\",SUBSTITUTE(AnalysesComparatives!C38,\"<\",\"\")*1)","v":""},{"$f":"IF(ISBLANK(AnalysesComparatives!E38),\"\",SUBSTITUTE(AnalysesComparatives!E38,\"<\",\"\")*1)","v":""},{"$f":"IF(OR(C19=\"\",B19=\"\"),\"\",IF(AND(B19<=SC_NG,C19<=SC_NG),\"-\",(B19-AVERAGE(B19:C19))/AVERAGE(B19:C19)))","v":""},{"$f":"IF(D19=\"\",\"\",IF(D19=\"-\",\"oui\",IF(OR(AND(AVERAGE(B19:C19)>NGfaible,ABS(D19)>3*EMT_NG_forte),AND(AVERAGE(B19:C19)<NGfaible,ABS(D19)>3*EMT_NG_faible)),\"non\",IF(AND(B19<=SC_NG,C19<=SC_NG),\"oui\",IF(AND(AVERAGE(B19:C19)>NGfaible,D19>=-EMT_NG_forte,D19<=EMT_NG_forte),\"oui\",IF(AND(AVERAGE(B19:C19)<=NGfaible,D19>=-EMT_NG_faible,D19<=EMT_NG_faible),\"oui\",\"non\"))))))","v":""},{"$f":"IF(ISBLANK(AnalysesComparatives!I38),\"\",SUBSTITUTE(AnalysesComparatives!I38,\"<\",\"\")*1)","v":""},{"$f":"IF(ISBLANK(AnalysesComparatives!J38),\"\",SUBSTITUTE(AnalysesComparatives!J38,\"<\",\"\")*1)","v":""},{"$f":"IF(OR(G19=\"\",F19=\"\"),\"\",IF(AND(F19<=SC_NG,G19<=SC_NG),\"-\",(F19-AVERAGE(F19:G19))/AVERAGE(F19:G19)))","v":""},{"$f":"IF(H19=\"\",\"\",IF(H19=\"-\",\"oui\",IF(OR(AND(AVERAGE(F19:G19)>NGfaible,ABS(H19)>3*EMT_NG_forte),AND(AVERAGE(F19:G19)<NGfaible,ABS(H19)>3*EMT_NG_faible)),\"non\",IF(AND(F19<=SC_NG,G19<=SC_NG),\"oui\",IF(AND(AVERAGE(F19:G19)>NGfaible,H19>=-EMT_NG_forte,H19<=EMT_NG_forte),\"oui\",IF(AND(AVERAGE(F19:G19)<=NGfaible,H19>=-EMT_NG_faible,H19<=EMT_NG_faible),\"oui\",\"non\"))))))","v":""},{"$f":"IF(ISBLANK(AnalysesComparatives!M38),\"\",SUBSTITUTE(AnalysesComparatives!M38,\"<\",\"\")*1)","v":{"$error":"#VALUE!"}},{"$f":"IF(ISBLANK(AnalysesComparatives!N38),\"\",SUBSTITUTE(AnalysesComparatives!N38,\"<\",\"\")*1)","v":{"$error":"#VALUE!"}},{"$f":"IF(OR(K19=\"\",J19=\"\"),\"\",IF(AND(J19<=SC_NG,K19<=SC_NG),\"-\",(J19-AVERAGE(J19:K19))/AVERAGE(J19:K19)))","v":{"$error":"#VALUE!"}},{"$f":"IF(L19=\"\",\"\",IF(L19=\"-\",\"oui\",IF(OR(AND(AVERAGE(J19:K19)>NGfaible,ABS(L19)>3*EMT_NG_forte),AND(AVERAGE(J19:K19)<NGfaible,ABS(L19)>3*EMT_NG_faible)),\"non\",IF(AND(J19<=SC_NG,K19<=SC_NG),\"oui\",IF(AND(AVERAGE(J19:K19)>NGfaible,L19>=-EMT_NG_forte,L19<=EMT_NG_forte),\"oui\",IF(AND(AVERAGE(J19:K19)<=NGfaible,L19>=-EMT_NG_faible,L19<=EMT_NG_faible),\"oui\",\"non\"))))))","v":{"$error":"#VALUE!"}}]
["PT",{"$f":"IF(ISBLANK(AnalysesComparatives!C41),\"\",SUBSTITUTE(AnalysesComparatives!C41,\"<\",\"\")*1)","v":""},{"$f":"IF(ISBLANK(AnalysesComparatives!E41),\"\",SUBSTITUTE(AnalysesComparatives!E41,\"<\",\"\")*1)","v":""},{"$f":"IF(OR(C20=\"\",B20=\"\"),\"\",IF(AND(B20<=SC_Pt,C20<=SC_Pt),\"-\",(B20-AVERAGE(B20:C20))/AVERAGE(B20:C20)))","v":""},{"$f":"IF(D20=\"\",\"\",IF(D20=\"-\",\"oui\",IF(OR(AND(AVERAGE(B20:C20)>Ptfaible,ABS(D20)>3*EMT_Pt_forte),AND(AVERAGE(B20:C20)<Ptfaible,ABS(D20)>3*EMT_Pt_faible)),\"non\",IF(AND(B20<=SC_Pt,C20<=SC_Pt),\"oui\",IF(AND(AVERAGE(B20:C20)>Ptfaible,D20>=-EMT_Pt_forte,D20<=EMT_Pt_forte),\"oui\",IF(AND(AVERAGE(B20:C20)<=Ptfaible,D20>=-EMT_Pt_faible,D20<=EMT_Pt_faible),\"oui\",\"non\"))))))","v":""},{"$f":"IF(ISBLANK(AnalysesComparatives!I41),\"\",SUBSTITUTE(AnalysesComparatives!I41,\"<\",\"\")*1)","v":""},{"$f":"IF(ISBLANK(AnalysesComparatives!J41),\"\",SUBSTITUTE(AnalysesComparatives!J41,\"<\",\"\")*1)","v":""},{"$f":"IF(OR(G20=\"\",F20=\"\"),\"\",IF(AND(F20<=SC_Pt,G20<=SC_Pt),\"-\",(F20-AVERAGE(F20:G20))/AVERAGE(F20:G20)))","v":""},{"$f":"IF(H20=\"\",\"\",IF(H20=\"-\",\"oui\",IF(OR(AND(AVERAGE(F20:G20)>Ptfaible,ABS(H20)>3*EMT_Pt_forte),AND(AVERAGE(F20:G20)<Ptfaible,ABS(H20)>3*EMT_Pt_faible)),\"non\",IF(AND(F20<=SC_Pt,G20<=SC_Pt),\"oui\",IF(AND(AVERAGE(F20:G20)>Ptfaible,H20>=-EMT_Pt_forte,H20<=EMT_Pt_forte),\"oui\",IF(AND(AVERAGE(F20:G20)<=Ptfaible,H20>=-EMT_Pt_faible,H20<=EMT_Pt_faible),\"oui\",\"non\"))))))","v":""},{"$f":"IF(ISBLANK(AnalysesComparatives!M41),\"\",SUBSTITUTE(AnalysesComparatives!M41,\"<\",\"\")*1)","v":{"$error":"#VALUE!"}},{"$f":"IF(ISBLANK(AnalysesComparatives!N41),\"\",SUBSTITUTE(AnalysesComparatives!N41,\"<\",\"\")*1)","v":{"$error":"#VALUE!"}},{"$f":"IF(OR(K20=\"\",J20=\"\"),\"\",IF(AND(J20<=SC_Pt,K20<=SC_Pt),\"-\",(J20-AVERAGE(J20:K20))/AVERAGE(J20:K20)))","v":{"$error":"#VALUE!"}},{"$f":"IF(L20=\"\",\"\",IF(L20=\"-\",\"oui\",IF(OR(AND(AVERAGE(J20:K20)>Ptfaible,ABS(L20)>3*EMT_Pt_forte),AND(AVERAGE(J20:K20)<Ptfaible,ABS(L20)>3*EMT_Pt_faible)),\"non\",IF(AND(J20<=SC_Pt,K20<=SC_Pt),\"oui\",IF(AND(AVERAGE(J20:K20)>Ptfaible,L20>=-EMT_Pt_forte,L20<=EMT_Pt_forte),\"oui\",IF(AND(AVERAGE(J20:K20)<=Ptfaible,L20>=-EMT_Pt_faible,L20<=EMT_Pt_faible),\"oui\",\"non\"))))))","v":{"$error":"#VALUE!"}}]
["ST_DCO",{"$f":"IF(ISBLANK(AnalysesComparatives!#REF!),\"\",SUBSTITUTE(AnalysesComparatives!#REF!,\"<\",\"\")*1)","v":{"$error":"#REF!"}},{"$f":"IF(ISBLANK(AnalysesComparatives!#REF!),\"\",SUBSTITUTE(AnalysesComparatives!#REF!,\"<\",\"\")*1)","v":{"$error":"#REF!"}},{"$f":"IF(OR(C21=\"\",B21=\"\"),\"\",IF(AND(B21<=SC_ST_DCO,C21<=SC_ST_DCO),\"-\",(B21-AVERAGE(B21:C21))/AVERAGE(B21:C21)))","v":{"$error":"#REF!"}},{"$f":"IF(D21=\"\",\"\",IF(D21=\"-\",\"oui\",IF(OR(AND(AVERAGE(B21:C21)>ST_DCOfaible,ABS(D21)>3*EMT_ST_DCO_forte),AND(AVERAGE(B21:C21)<ST_DCOfaible,ABS(D21)>3*EMT_ST_DCO_faible)),\"non\",IF(AND(B21<=SC_ST_DCO,C21<=SC_ST_DCO),\"oui\",IF(AND(AVERAGE(B21:C21)>ST_DCOfaible,D21>=-EMT_ST_DCO_forte,D21<=EMT_ST_DCO_forte),\"oui\",IF(AND(AVERAGE(B21:C21)<=ST_DCOfaible,D21>=-EMT_ST_DCO_faible,D21<=EMT_ST_DCO_faible),\"oui\",\"non\"))))))","v":{"$error":"#REF!"}},{"$f":"IF(ISBLANK(AnalysesComparatives!#REF!),\"\",SUBSTITUTE(AnalysesComparatives!#REF!,\"<\",\"\")*1)","v":{"$error":"#REF!"}},{"$f":"IF(ISBLANK(AnalysesComparatives!#REF!),\"\",SUBSTITUTE(AnalysesComparatives!#REF!,\"<\",\"\")*1)","v":{"$error":"#REF!"}},{"$f":"IF(OR(G21=\"\",F21=\"\"),\"\",IF(AND(F21<=SC_ST_DCO,G21<=SC_ST_DCO),\"-\",(F21-AVERAGE(F21:G21))/AVERAGE(F21:G21)))","v":{"$error":"#REF!"}},{"$f":"IF(H21=\"\",\"\",IF(H21=\"-\",\"oui\",IF(OR(AND(AVERAGE(F21:G21)>ST_DCOfaible,ABS(H21)>3*EMT_ST_DCO_forte),AND(AVERAGE(F21:G21)<ST_DCOfaible,ABS(H21)>3*EMT_ST_DCO_faible)),\"non\",IF(AND(F21<=SC_ST_DCO,G21<=SC_ST_DCO),\"oui\",IF(AND(AVERAGE(F21:G21)>ST_DCOfaible,H21>=-EMT_ST_DCO_forte,H21<=EMT_ST_DCO_forte),\"oui\",IF(AND(AVERAGE(F21:G21)<=ST_DCOfaible,H21>=-EMT_ST_DCO_faible,H21<=EMT_ST_DCO_faible),\"oui\",\"non\"))))))","v":{"$error":"#REF!"}},{"$f":"IF(ISBLANK(AnalysesComparatives!#REF!),\"\",SUBSTITUTE(AnalysesComparatives!#REF!,\"<\",\"\")*1)","v":{"$error":"#REF!"}},{"$f":"IF(ISBLANK(AnalysesComparatives!#REF!),\"\",SUBSTITUTE(AnalysesComparatives!#REF!,\"<\",\"\")*1)","v":{"$error":"#REF!"}},{"$f":"IF(OR(K21=\"\",J21=\"\"),\"\",IF(AND(J21<=SC_ST_DCO,K21<=SC_ST_DCO),\"-\",(J21-AVERAGE(J21:K21))/AVERAGE(J21:K21)))","v":{"$error":"#REF!"}},{"$f":"IF(L21=\"\",\"\",IF(L21=\"-\",\"oui\",IF(OR(AND(AVERAGE(J21:K21)>ST_DCOfaible,ABS(L21)>3*EMT_ST_DCO_forte),AND(AVERAGE(J21:K21)<ST_DCOfaible,ABS(L21)>3*EMT_ST_DCO_faible)),\"non\",IF(AND(J21<=SC_ST_DCO,K21<=SC_ST_DCO),\"oui\",IF(AND(AVERAGE(J21:K21)>ST_DCOfaible,L21>=-EMT_ST_DCO_forte,L21<=EMT_ST_DCO_forte),\"oui\",IF(AND(AVERAGE(J21:K21)<=ST_DCOfaible,L21>=-EMT_ST_DCO_faible,L21<=EMT_ST_DCO_faible),\"oui\",\"non\"))))))","v":{"$error":"#REF!"}}]
["As",{"$f":"IF(ISBLANK(AnalysesComparatives!C42),\"\",SUBSTITUTE(AnalysesComparatives!C42,\"<\",\"\")*1)","v":""},{"$f":"IF(ISBLANK(AnalysesComparatives!E42),\"\",SUBSTITUTE(AnalysesComparatives!E42,\"<\",\"\")*1)","v":""},{"$f":"IF(OR(C22=\"\",B22=\"\"),\"\",IF(AND(B22<=SC_Metaux,C22<=SC_Metaux),\"-\",(B22-AVERAGE(B22:C22))/AVERAGE(B22:C22)))","v":""},{"$f":"IF(D22=\"\",\"\",IF(D22=\"-\",\"oui\",IF(OR(AND(AVERAGE(B22:C22)>Metauxfaible,ABS(D22)>3*EMT_Metaux_forte),AND(AVERAGE(B22:C22)<Metauxfaible,ABS(D22)>3*EMT_Metaux_faible)),\"non\",IF(AND(B22<=SC_Metaux,C22<=SC_Metaux),\"oui\",IF(AND(AVERAGE(B22:C22)>Metauxfaible,D22>=-EMT_Metaux_forte,D22<=EMT_Metaux_forte),\"oui\",IF(AND(AVERAGE(B22:C22)<=Metauxfaible,D22>=-EMT_Metaux_faible,D22<=EMT_Metaux_faible),\"oui\",\"non\"))))))","v":""},{"$f":"IF(ISBLANK(AnalysesComparatives!I42),\"\",SUBSTITUTE(AnalysesComparatives!I42,\"<\",\"\")*1)","v":""},{"$f":"IF(ISBLANK(AnalysesComparatives!J42),\"\",SUBSTITUTE(AnalysesComparatives!J42,\"<\",\"\")*1)","v":""},{"$f":"IF(OR(G22=\"\",F22=\"\"),\"\",IF(AND(F22<=SC_Metaux,G22<=SC_Metaux),\"-\",(F22-AVERAGE(F22:G22))/AVERAGE(F22:G22)))","v":""},{"$f":"IF(H22=\"\",\"\",IF(H22=\"-\",\"oui\",IF(OR(AND(AVERAGE(F22:G22)>Metauxfaible,ABS(H22)>3*EMT_Metaux_forte),AND(AVERAGE(F22:G22)<Metauxfaible,ABS(H22)>3*EMT_Metaux_faible)),\"non\",IF(AND(F22<=SC_Metaux,G22<=SC_Metaux),\"oui\",IF(AND(AVERAGE(F22:G22)>Metauxfaible,H22>=-EMT_Metaux_forte,H22<=EMT_Metaux_forte),\"oui\",IF(AND(AVERAGE(F22:G22)<=Metauxfaible,H22>=-EMT_Metaux_faible,H22<=EMT_Metaux_faible),\"oui\",\"non\"))))))","v":""},{"$f":"IF(ISBLANK(AnalysesComparatives!M42),\"\",SUBSTITUTE(AnalysesComparatives!M42,\"<\",\"\")*1)","v":{"$error":"#VALUE!"}},{"$f":"IF(ISBLANK(AnalysesComparatives!N42),\"\",SUBSTITUTE(AnalysesComparatives!N42,\"<\",\"\")*1)","v":{"$error":"#VALUE!"}},{"$f":"IF(OR(K22=\"\",J22=\"\"),\"\",IF(AND(J22<=SC_Metaux,K22<=SC_Metaux),\"-\",(J22-AVERAGE(J22:K22))/AVERAGE(J22:K22)))","v":{"$error":"#VALUE!"}},{"$f":"IF(L22=\"\",\"\",IF(L22=\"-\",\"oui\",IF(OR(AND(AVERAGE(J22:K22)>Metauxfaible,ABS(L22)>3*EMT_Metaux_forte),AND(AVERAGE(J22:K22)<Metauxfaible,ABS(L22)>3*EMT_Metaux_faible)),\"non\",IF(AND(J22<=SC_Metaux,K22<=SC_Metaux),\"oui\",IF(AND(AVERAGE(J22:K22)>Metauxfaible,L22>=-EMT_Metaux_forte,L22<=EMT_Metaux_forte),\"oui\",IF(AND(AVERAGE(J22:K22)<=Metauxfaible,L22>=-EMT_Metaux_faible,L22<=EMT_Metaux_faible),\"oui\",\"non\"))))))","v":{"$error":"#VALUE!"}}]
["Cd",{"$f":"IF(ISBLANK(AnalysesComparatives!C43),\"\",SUBSTITUTE(AnalysesComparatives!C43,\"<\",\"\")*1)","v":""},{"$f":"IF(ISBLANK(AnalysesComparatives!E43),\"\",SUBSTITUTE(AnalysesComparatives!E43,\"<\",\"\")*1)","v":""},"",{"$f":"IF(D23=\"\",\"\",IF(D23=\"-\",\"oui\",IF(OR(AND(AVERAGE(B23:C23)>Metauxfaible,ABS(D23)>3*EMT_Metaux_forte),AND(AVERAGE(B23:C23)<Metauxfaible,ABS(D23)>3*EMT_Metaux_faible)),\"non\",IF(AND(B23<=SC_Metaux,C23<=SC_Metaux),\"oui\",IF(AND(AVERAGE(B23:C23)>Metauxfaible,D23>=-EMT_Metaux_forte,D23<=EMT_Metaux_forte),\"oui\",IF(AND(AVERAGE(B23:C23)<=Metauxfaible,D23>=-EMT_Metaux_faible,D23<=EMT_Metaux_faible),\"oui\",\"non\"))))))","v":""},{"$f":"IF(ISBLANK(AnalysesComparatives!I43),\"\",SUBSTITUTE(AnalysesComparatives!I43,\"<\",\"\")*1)","v":""},{"$f":"IF(ISBLANK(AnalysesComparatives!J43),\"\",SUBSTITUTE(AnalysesComparatives!J43,\"<\",\"\")*1)","v":""},"",{"$f":"IF(H23=\"\",\"\",IF(H23=\"-\",\"oui\",IF(OR(AND(AVERAGE(F23:G23)>Metauxfaible,ABS(H23)>3*EMT_Metaux_forte),AND(AVERAGE(F23:G23)<Metauxfaible,ABS(H23)>3*EMT_Metaux_faible)),\"non\",IF(AND(F23<=SC_Metaux,G23<=SC_Metaux),\"oui\",IF(AND(AVERAGE(F23:G23)>Metauxfaible,H23>=-EMT_Metaux_forte,H23<=EMT_Metaux_forte),\"oui\",IF(AND(AVERAGE(F23:G23)<=Metauxfaible,H23>=-EMT_Metaux_faible,H23<=EMT_Metaux_faible),\"oui\",\"non\"))))))","v":""},{"$f":"IF(ISBLANK(AnalysesComparatives!M43),\"\",SUBSTITUTE(AnalysesComparatives!M43,\"<\",\"\")*1)","v":{"$error":"#VALUE!"}},{"$f":"IF(ISBLANK(AnalysesComparatives!N43),\"\",SUBSTITUTE(AnalysesComparatives!N43,\"<\",\"\")*1)","v":{"$error":"#VALUE!"}},{"$error":"#VALUE!"},{"$f":"IF(L23=\"\",\"\",IF(L23=\"-\",\"oui\",IF(OR(AND(AVERAGE(J23:K23)>Metauxfaible,ABS(L23)>3*EMT_Metaux_forte),AND(AVERAGE(J23:K23)<Metauxfaible,ABS(L23)>3*EMT_Metaux_faible)),\"non\",IF(AND(J23<=SC_Metaux,K23<=SC_Metaux),\"oui\",IF(AND(AVERAGE(J23:K23)>Metauxfaible,L23>=-EMT_Metaux_forte,L23<=EMT_Metaux_forte),\"oui\",IF(AND(AVERAGE(J23:K23)<=Metauxfaible,L23>=-EMT_Metaux_faible,L23<=EMT_Metaux_faible),\"oui\",\"non\"))))))","v":{"$error":"#VALUE!"}}]
["Cr",{"$f":"IF(ISBLANK(AnalysesComparatives!C44),\"\",SUBSTITUTE(AnalysesComparatives!C44,\"<\",\"\")*1)","v":""},{"$f":"IF(ISBLANK(AnalysesComparatives!E44),\"\",SUBSTITUTE(AnalysesComparatives!E44,\"<\",\"\")*1)","v":""},"",{"$f":"IF(D24=\"\",\"\",IF(D24=\"-\",\"oui\",IF(OR(AND(AVERAGE(B24:C24)>Metauxfaible,ABS(D24)>3*EMT_Metaux_forte),AND(AVERAGE(B24:C24)<Metauxfaible,ABS(D24)>3*EMT_Metaux_faible)),\"non\",IF(AND(B24<=SC_Metaux,C24<=SC_Metaux),\"oui\",IF(AND(AVERAGE(B24:C24)>Metauxfaible,D24>=-EMT_Metaux_forte,D24<=EMT_Metaux_forte),\"oui\",IF(AND(AVERAGE(B24:C24)<=Metauxfaible,D24>=-EMT_Metaux_faible,D24<=EMT_Metaux_faible),\"oui\",\"non\"))))))","v":""},{"$f":"IF(ISBLANK(AnalysesComparatives!I44),\"\",SUBSTITUTE(AnalysesComparatives!I44,\"<\",\"\")*1)","v":""},{"$f":"IF(ISBLANK(AnalysesComparatives!J44),\"\",SUBSTITUTE(AnalysesComparatives!J44,\"<\",\"\")*1)","v":""},"",{"$f":"IF(H24=\"\",\"\",IF(H24=\"-\",\"oui\",IF(OR(AND(AVERAGE(F24:G24)>Metauxfaible,ABS(H24)>3*EMT_Metaux_forte),AND(AVERAGE(F24:G24)<Metauxfaible,ABS(H24)>3*EMT_Metaux_faible)),\"non\",IF(AND(F24<=SC_Metaux,G24<=SC_Metaux),\"oui\",IF(AND(AVERAGE(F24:G24)>Metauxfaible,H24>=-EMT_Metaux_forte,H24<=EMT_Metaux_forte),\"oui\",IF(AND(AVERAGE(F24:G24)<=Metauxfaible,H24>=-EMT_Metaux_faible,H24<=EMT_Metaux_faible),\"oui\",\"non\"))))))","v":""},{"$f":"IF(ISBLANK(AnalysesComparatives!M44),\"\",SUBSTITUTE(AnalysesComparatives!M44,\"<\",\"\")*1)","v":{"$error":"#VALUE!"}},{"$f":"IF(ISBLANK(AnalysesComparatives!N44),\"\",SUBSTITUTE(AnalysesComparatives!N44,\"<\",\"\")*1)","v":{"$error":"#VALUE!"}},{"$error":"#VALUE!"},{"$f":"IF(L24=\"\",\"\",IF(L24=\"-\",\"oui\",IF(OR(AND(AVERAGE(J24:K24)>Metauxfaible,ABS(L24)>3*EMT_Metaux_forte),AND(AVERAGE(J24:K24)<Metauxfaible,ABS(L24)>3*EMT_Metaux_faible)),\"non\",IF(AND(J24<=SC_Metaux,K24<=SC_Metaux),\"oui\",IF(AND(AVERAGE(J24:K24)>Metauxfaible,L24>=-EMT_Metaux_forte,L24<=EMT_Metaux_forte),\"oui\",IF(AND(AVERAGE(J24:K24)<=Metauxfaible,L24>=-EMT_Metaux_faible,L24<=EMT_Metaux_faible),\"oui\",\"non\"))))))","v":{"$error":"#VALUE!"}}]
["Cu",{"$f":"IF(ISBLANK(AnalysesComparatives!C45),\"\",SUBSTITUTE(AnalysesComparatives!C45,\"<\",\"\")*1)","v":""},{"$f":"IF(ISBLANK(AnalysesComparatives!E45),\"\",SUBSTITUTE(AnalysesComparatives!E45,\"<\",\"\")*1)","v":""},"",{"$f":"IF(D25=\"\",\"\",IF(D25=\"-\",\"oui\",IF(OR(AND(AVERAGE(B25:C25)>Metauxfaible,ABS(D25)>3*EMT_Metaux_forte),AND(AVERAGE(B25:C25)<Metauxfaible,ABS(D25)>3*EMT_Metaux_faible)),\"non\",IF(AND(B25<=SC_Metaux,C25<=SC_Metaux),\"oui\",IF(AND(AVERAGE(B25:C25)>Metauxfaible,D25>=-EMT_Metaux_forte,D25<=EMT_Metaux_forte),\"oui\",IF(AND(AVERAGE(B25:C25)<=Metauxfaible,D25>=-EMT_Metaux_faible,D25<=EMT_Metaux_faible),\"oui\",\"non\"))))))","v":""},{"$f":"IF(ISBLANK(AnalysesComparatives!I45),\"\",SUBSTITUTE(AnalysesComparatives!I45,\"<\",\"\")*1)","v":""},{"$f":"IF(ISBLANK(AnalysesComparatives!J45),\"\",SUBSTITUTE(AnalysesComparatives!J45,\"<\",\"\")*1)","v":""},"",{"$f":"IF(H25=\"\",\"\",IF(H25=\"-\",\"oui\",IF(OR(AND(AVERAGE(F25:G25)>Metauxfaible,ABS(H25)>3*EMT_Metaux_forte),AND(AVERAGE(F25:G25)<Metauxfaible,ABS(H25)>3*EMT_Metaux_faible)),\"non\",IF(AND(F25<=SC_Metaux,G25<=SC_Metaux),\"oui\",IF(AND(AVERAGE(F25:G25)>Metauxfaible,H25>=-EMT_Metaux_forte,H25<=EMT_Metaux_forte),\"oui\",IF(AND(AVERAGE(F25:G25)<=Metauxfaible,H25>=-EMT_Metaux_faible,H25<=EMT_Metaux_faible),\"oui\",\"non\"))))))","v":""},{"$f":"IF(ISBLANK(AnalysesComparatives!M45),\"\",SUBSTITUTE(AnalysesComparatives!M45,\"<\",\"\")*1)","v":{"$error":"#VALUE!"}},{"$f":"IF(ISBLANK(AnalysesComparatives!N45),\"\",SUBSTITUTE(AnalysesComparatives!N45,\"<\",\"\")*1)","v":{"$error":"#VALUE!"}},{"$error":"#VALUE!"},{"$f":"IF(L25=\"\",\"\",IF(L25=\"-\",\"oui\",IF(OR(AND(AVERAGE(J25:K25)>Metauxfaible,ABS(L25)>3*EMT_Metaux_forte),AND(AVERAGE(J25:K25)<Metauxfaible,ABS(L25)>3*EMT_Metaux_faible)),\"non\",IF(AND(J25<=SC_Metaux,K25<=SC_Metaux),\"oui\",IF(AND(AVERAGE(J25:K25)>Metauxfaible,L25>=-EMT_Metaux_forte,L25<=EMT_Metaux_forte),\"oui\",IF(AND(AVERAGE(J25:K25)<=Metauxfaible,L25>=-EMT_Metaux_faible,L25<=EMT_Metaux_faible),\"oui\",\"non\"))))))","v":{"$error":"#VALUE!"}}]
["Hg",{"$f":"IF(ISBLANK(AnalysesComparatives!C46),\"\",SUBSTITUTE(AnalysesComparatives!C46,\"<\",\"\")*1)","v":""},{"$f":"IF(ISBLANK(AnalysesComparatives!E46),\"\",SUBSTITUTE(AnalysesComparatives!E46,\"<\",\"\")*1)","v":""},"",{"$f":"IF(D26=\"\",\"\",IF(D26=\"-\",\"oui\",IF(OR(AND(AVERAGE(B26:C26)>Hgfaible,ABS(D26)>3*EMT_Hg_forte),AND(AVERAGE(B26:C26)<Hgfaible,ABS(D26)>3*EMT_Hg_faible)),\"non\",IF(AND(B26<=SC_Hg,C26<=SC_Hg),\"oui\",IF(AND(AVERAGE(B26:C26)>Hgfaible,D26>=-EMT_Hg_forte,D26<=EMT_Hg_forte),\"oui\",IF(AND(AVERAGE(B26:C26)<=Hgfaible,D26>=-EMT_Hg_faible,D26<=EMT_Hg_faible),\"oui\",\"non\"))))))","v":""},{"$f":"IF(ISBLANK(AnalysesComparatives!I46),\"\",SUBSTITUTE(AnalysesComparatives!I46,\"<\",\"\")*1)","v":""},{"$f":"IF(ISBLANK(AnalysesComparatives!J46),\"\",SUBSTITUTE(AnalysesComparatives!J46,\"<\",\"\")*1)","v":""},"",{"$f":"IF(H26=\"\",\"\",IF(H26=\"-\",\"oui\",IF(OR(AND(AVERAGE(F26:G26)>Hgfaible,ABS(H26)>3*EMT_Hg_forte),AND(AVERAGE(F26:G26)<Hgfaible,ABS(H26)>3*EMT_Hg_faible)),\"non\",IF(AND(F26<=SC_Hg,G26<=SC_Hg),\"oui\",IF(AND(AVERAGE(F26:G26)>Hgfaible,H26>=-EMT_Hg_forte,H26<=EMT_Hg_forte),\"oui\",IF(AND(AVERAGE(F26:G26)<=Hgfaible,H26>=-EMT_Hg_faible,H26<=EMT_Hg_faible),\"oui\",\"non\"))))))","v":""},{"$f":"IF(ISBLANK(AnalysesComparatives!M46),\"\",SUBSTITUTE(AnalysesComparatives!M46,\"<\",\"\")*1)","v":{"$error":"#VALUE!"}},{"$f":"IF(ISBLANK(AnalysesComparatives!N46),\"\",SUBSTITUTE(AnalysesComparatives!N46,\"<\",\"\")*1)","v":{"$error":"#VALUE!"}},{"$error":"#VALUE!"},{"$f":"IF(L26=\"\",\"\",IF(L26=\"-\",\"oui\",IF(OR(AND(AVERAGE(J26:K26)>Hgfaible,ABS(L26)>3*EMT_Hg_forte),AND(AVERAGE(J26:K26)<Hgfaible,ABS(L26)>3*EMT_Hg_faible)),\"non\",IF(AND(J26<=SC_Hg,K26<=SC_Hg),\"oui\",IF(AND(AVERAGE(J26:K26)>Hgfaible,L26>=-EMT_Hg_forte,L26<=EMT_Hg_forte),\"oui\",IF(AND(AVERAGE(J26:K26)<=Hgfaible,L26>=-EMT_Hg_faible,L26<=EMT_Hg_faible),\"oui\",\"non\"))))))","v":{"$error":"#VALUE!"}}]
["Ni",{"$f":"IF(ISBLANK(AnalysesComparatives!C47),\"\",SUBSTITUTE(AnalysesComparatives!C47,\"<\",\"\")*1)","v":""},{"$f":"IF(ISBLANK(AnalysesComparatives!E47),\"\",SUBSTITUTE(AnalysesComparatives!E47,\"<\",\"\")*1)","v":""},"",{"$f":"IF(D27=\"\",\"\",IF(D27=\"-\",\"oui\",IF(OR(AND(AVERAGE(B27:C27)>Metauxfaible,ABS(D27)>3*EMT_Metaux_forte),AND(AVERAGE(B27:C27)<Metauxfaible,ABS(D27)>3*EMT_Metaux_faible)),\"non\",IF(AND(B27<=SC_Metaux,C27<=SC_Metaux),\"oui\",IF(AND(AVERAGE(B27:C27)>Metauxfaible,D27>=-EMT_Metaux_forte,D27<=EMT_Metaux_forte),\"oui\",IF(AND(AVERAGE(B27:C27)<=Metauxfaible,D27>=-EMT_Metaux_faible,D27<=EMT_Metaux_faible),\"oui\",\"non\"))))))","v":""},{"$f":"IF(ISBLANK(AnalysesComparatives!I47),\"\",SUBSTITUTE(AnalysesComparatives!I47,\"<\",\"\")*1)","v":""},{"$f":"IF(ISBLANK(AnalysesComparatives!J47),\"\",SUBSTITUTE(AnalysesComparatives!J47,\"<\",\"\")*1)","v":""},"",{"$f":"IF(H27=\"\",\"\",IF(H27=\"-\",\"oui\",IF(OR(AND(AVERAGE(F27:G27)>Metauxfaible,ABS(H27)>3*EMT_Metaux_forte),AND(AVERAGE(F27:G27)<Metauxfaible,ABS(H27)>3*EMT_Metaux_faible)),\"non\",IF(AND(F27<=SC_Metaux,G27<=SC_Metaux),\"oui\",IF(AND(AVERAGE(F27:G27)>Metauxfaible,H27>=-EMT_Metaux_forte,H27<=EMT_Metaux_forte),\"oui\",IF(AND(AVERAGE(F27:G27)<=Metauxfaible,H27>=-EMT_Metaux_faible,H27<=EMT_Metaux_faible),\"oui\",\"non\"))))))","v":""},{"$f":"IF(ISBLANK(AnalysesComparatives!M47),\"\",SUBSTITUTE(AnalysesComparatives!M47,\"<\",\"\")*1)","v":{"$error":"#VALUE!"}},{"$f":"IF(ISBLANK(AnalysesComparatives!N47),\"\",SUBSTITUTE(AnalysesComparatives!N47,\"<\",\"\")*1)","v":{"$error":"#VALUE!"}},{"$error":"#VALUE!"},{"$f":"IF(L27=\"\",\"\",IF(L27=\"-\",\"oui\",IF(OR(AND(AVERAGE(J27:K27)>Metauxfaible,ABS(L27)>3*EMT_Metaux_forte),AND(AVERAGE(J27:K27)<Metauxfaible,ABS(L27)>3*EMT_Metaux_faible)),\"non\",IF(AND(J27<=SC_Metaux,K27<=SC_Metaux),\"oui\",IF(AND(AVERAGE(J27:K27)>Metauxfaible,L27>=-EMT_Metaux_forte,L27<=EMT_Metaux_forte),\"oui\",IF(AND(AVERAGE(J27:K27)<=Metauxfaible,L27>=-EMT_Metaux_faible,L27<=EMT_Metaux_faible),\"oui\",\"non\"))))))","v":{"$error":"#VALUE!"}}]
["Pb",{"$f":"IF(ISBLANK(AnalysesComparatives!C49),\"\",SUBSTITUTE(AnalysesComparatives!C49,\"<\",\"\")*1)","v":""},{"$f":"IF(ISBLANK(AnalysesComparatives!E49),\"\",SUBSTITUTE(AnalysesComparatives!E49,\"<\",\"\")*1)","v":""},"",{"$f":"IF(D28=\"\",\"\",IF(D28=\"-\",\"oui\",IF(OR(AND(AVERAGE(B28:C28)>Metauxfaible,ABS(D28)>3*EMT_Metaux_forte),AND(AVERAGE(B28:C28)<Metauxfaible,ABS(D28)>3*EMT_Metaux_faible)),\"non\",IF(AND(B28<=SC_Metaux,C28<=SC_Metaux),\"oui\",IF(AND(AVERAGE(B28:C28)>Metauxfaible,D28>=-EMT_Metaux_forte,D28<=EMT_Metaux_forte),\"oui\",IF(AND(AVERAGE(B28:C28)<=Metauxfaible,D28>=-EMT_Metaux_faible,D28<=EMT_Metaux_faible),\"oui\",\"non\"))))))","v":""},{"$f":"IF(ISBLANK(AnalysesComparatives!I49),\"\",SUBSTITUTE(AnalysesComparatives!I49,\"<\",\"\")*1)","v":""},{"$f":"IF(ISBLANK(AnalysesComparatives!J49),\"\",SUBSTITUTE(AnalysesComparatives!J49,\"<\",\"\")*1)","v":""},"",{"$f":"IF(H28=\"\",\"\",IF(H28=\"-\",\"oui\",IF(OR(AND(AVERAGE(F28:G28)>Metauxfaible,ABS(H28)>3*EMT_Metaux_forte),AND(AVERAGE(F28:G28)<Metauxfaible,ABS(H28)>3*EMT_Metaux_faible)),\"non\",IF(AND(F28<=SC_Metaux,G28<=SC_Metaux),\"oui\",IF(AND(AVERAGE(F28:G28)>Metauxfaible,H28>=-EMT_Metaux_forte,H28<=EMT_Metaux_forte),\"oui\",IF(AND(AVERAGE(F28:G28)<=Metauxfaible,H28>=-EMT_Metaux_faible,H28<=EMT_Metaux_faible),\"oui\",\"non\"))))))","v":""},{"$f":"IF(ISBLANK(AnalysesComparatives!M49),\"\",SUBSTITUTE(AnalysesComparatives!M49,\"<\",\"\")*1)","v":{"$error":"#VALUE!"}},{"$f":"IF(ISBLANK(AnalysesComparatives!N49),\"\",SUBSTITUTE(AnalysesComparatives!N49,\"<\",\"\")*1)","v":{"$error":"#VALUE!"}},{"$error":"#VALUE!"},{"$f":"IF(L28=\"\",\"\",IF(L28=\"-\",\"oui\",IF(OR(AND(AVERAGE(J28:K28)>Metauxfaible,ABS(L28)>3*EMT_Metaux_forte),AND(AVERAGE(J28:K28)<Metauxfaible,ABS(L28)>3*EMT_Metaux_faible)),\"non\",IF(AND(J28<=SC_Metaux,K28<=SC_Metaux),\"oui\",IF(AND(AVERAGE(J28:K28)>Metauxfaible,L28>=-EMT_Metaux_forte,L28<=EMT_Metaux_forte),\"oui\",IF(AND(AVERAGE(J28:K28)<=Metauxfaible,L28>=-EMT_Metaux_faible,L28<=EMT_Metaux_faible),\"oui\",\"non\"))))))","v":{"$error":"#VALUE!"}}]
["Zn",{"$f":"IF(ISBLANK(AnalysesComparatives!C52),\"\",SUBSTITUTE(AnalysesComparatives!C52,\"<\",\"\")*1)","v":""},{"$f":"IF(ISBLANK(AnalysesComparatives!E52),\"\",SUBSTITUTE(AnalysesComparatives!E52,\"<\",\"\")*1)","v":""},"",{"$f":"IF(D29=\"\",\"\",IF(D29=\"-\",\"oui\",IF(OR(AND(AVERAGE(B29:C29)>Metauxfaible,ABS(D29)>3*EMT_Metaux_forte),AND(AVERAGE(B29:C29)<Metauxfaible,ABS(D29)>3*EMT_Metaux_faible)),\"non\",IF(AND(B29<=SC_Metaux,C29<=SC_Metaux),\"oui\",IF(AND(AVERAGE(B29:C29)>Metauxfaible,D29>=-EMT_Metaux_forte,D29<=EMT_Metaux_forte),\"oui\",IF(AND(AVERAGE(B29:C29)<=Metauxfaible,D29>=-EMT_Metaux_faible,D29<=EMT_Metaux_faible),\"oui\",\"non\"))))))","v":""},{"$f":"IF(ISBLANK(AnalysesComparatives!I52),\"\",SUBSTITUTE(AnalysesComparatives!I52,\"<\",\"\")*1)","v":""},{"$f":"IF(ISBLANK(AnalysesComparatives!J52),\"\",SUBSTITUTE(AnalysesComparatives!J52,\"<\",\"\")*1)","v":""},"",{"$f":"IF(H29=\"\",\"\",IF(H29=\"-\",\"oui\",IF(OR(AND(AVERAGE(F29:G29)>Metauxfaible,ABS(H29)>3*EMT_Metaux_forte),AND(AVERAGE(F29:G29)<Metauxfaible,ABS(H29)>3*EMT_Metaux_faible)),\"non\",IF(AND(F29<=SC_Metaux,G29<=SC_Metaux),\"oui\",IF(AND(AVERAGE(F29:G29)>Metauxfaible,H29>=-EMT_Metaux_forte,H29<=EMT_Metaux_forte),\"oui\",IF(AND(AVERAGE(F29:G29)<=Metauxfaible,H29>=-EMT_Metaux_faible,H29<=EMT_Metaux_faible),\"oui\",\"non\"))))))","v":""},{"$f":"IF(ISBLANK(AnalysesComparatives!M52),\"\",SUBSTITUTE(AnalysesComparatives!M52,\"<\",\"\")*1)","v":{"$error":"#VALUE!"}},{"$f":"IF(ISBLANK(AnalysesComparatives!N52),\"\",SUBSTITUTE(AnalysesComparatives!N52,\"<\",\"\")*1)","v":{"$error":"#VALUE!"}},{"$error":"#VALUE!"},{"$f":"IF(L29=\"\",\"\",IF(L29=\"-\",\"oui\",IF(OR(AND(AVERAGE(J29:K29)>Metauxfaible,ABS(L29)>3*EMT_Metaux_forte),AND(AVERAGE(J29:K29)<Metauxfaible,ABS(L29)>3*EMT_Metaux_faible)),\"non\",IF(AND(J29<=SC_Metaux,K29<=SC_Metaux),\"oui\",IF(AND(AVERAGE(J29:K29)>Metauxfaible,L29>=-EMT_Metaux_forte,L29<=EMT_Metaux_forte),\"oui\",IF(AND(AVERAGE(J29:K29)<=Metauxfaible,L29>=-EMT_Metaux_faible,L29<=EMT_Metaux_faible),\"oui\",\"non\"))))))","v":{"$error":"#VALUE!"}}]
["Autres métaux",{"$f":"IF(ISBLANK(AnalysesComparatives!#REF!),\"\",SUBSTITUTE(AnalysesComparatives!#REF!,\"<\",\"\")*1)","v":{"$error":"#REF!"}},{"$f":"IF(ISBLANK(AnalysesComparatives!#REF!),\"\",SUBSTITUTE(AnalysesComparatives!#REF!,\"<\",\"\")*1)","v":{"$error":"#REF!"}},{"$error":"#REF!"},{"$f":"IF(D30=\"\",\"\",IF(D30=\"-\",\"oui\",IF(OR(AND(AVERAGE(B30:C30)>Metauxfaible,ABS(D30)>3*EMT_Metaux_forte),AND(AVERAGE(B30:C30)<Metauxfaible,ABS(D30)>3*EMT_Metaux_faible)),\"non\",IF(AND(B30<=SC_Metaux,C30<=SC_Metaux),\"oui\",IF(AND(AVERAGE(B30:C30)>Metauxfaible,D30>=-EMT_Metaux_forte,D30<=EMT_Metaux_forte),\"oui\",IF(AND(AVERAGE(B30:C30)<=Metauxfaible,D30>=-EMT_Metaux_faible,D30<=EMT_Metaux_faible),\"oui\",\"non\"))))))","v":{"$error":"#REF!"}},{"$f":"IF(ISBLANK(AnalysesComparatives!#REF!),\"\",SUBSTITUTE(AnalysesComparatives!#REF!,\"<\",\"\")*1)","v":{"$error":"#REF!"}},{"$f":"IF(ISBLANK(AnalysesComparatives!#REF!),\"\",SUBSTITUTE(AnalysesComparatives!#REF!,\"<\",\"\")*1)","v":{"$error":"#REF!"}},{"$error":"#REF!"},{"$f":"IF(H30=\"\",\"\",IF(H30=\"-\",\"oui\",IF(OR(AND(AVERAGE(F30:G30)>Metauxfaible,ABS(H30)>3*EMT_Metaux_forte),AND(AVERAGE(F30:G30)<Metauxfaible,ABS(H30)>3*EMT_Metaux_faible)),\"non\",IF(AND(F30<=SC_Metaux,G30<=SC_Metaux),\"oui\",IF(AND(AVERAGE(F30:G30)>Metauxfaible,H30>=-EMT_Metaux_forte,H30<=EMT_Metaux_forte),\"oui\",IF(AND(AVERAGE(F30:G30)<=Metauxfaible,H30>=-EMT_Metaux_faible,H30<=EMT_Metaux_faible),\"oui\",\"non\"))))))","v":{"$error":"#REF!"}},{"$f":"IF(ISBLANK(AnalysesComparatives!#REF!),\"\",SUBSTITUTE(AnalysesComparatives!#REF!,\"<\",\"\")*1)","v":{"$error":"#REF!"}},{"$f":"IF(ISBLANK(AnalysesComparatives!#REF!),\"\",SUBSTITUTE(AnalysesComparatives!#REF!,\"<\",\"\")*1)","v":{"$error":"#REF!"}},{"$error":"#REF!"},{"$f":"IF(L30=\"\",\"\",IF(L30=\"-\",\"oui\",IF(OR(AND(AVERAGE(J30:K30)>Metauxfaible,ABS(L30)>3*EMT_Metaux_forte),AND(AVERAGE(J30:K30)<Metauxfaible,ABS(L30)>3*EMT_Metaux_faible)),\"non\",IF(AND(J30<=SC_Metaux,K30<=SC_Metaux),\"oui\",IF(AND(AVERAGE(J30:K30)>Metauxfaible,L30>=-EMT_Metaux_forte,L30<=EMT_Metaux_forte),\"oui\",IF(AND(AVERAGE(J30:K30)<=Metauxfaible,L30>=-EMT_Metaux_faible,L30<=EMT_Metaux_faible),\"oui\",\"non\"))))))","v":{"$error":"#REF!"}}]
["CN",{"$f":"IF(ISBLANK(AnalysesComparatives!#REF!),\"\",SUBSTITUTE(AnalysesComparatives!#REF!,\"<\",\"\")*1)","v":{"$error":"#REF!"}},{"$f":"IF(ISBLANK(AnalysesComparatives!#REF!),\"\",SUBSTITUTE(AnalysesComparatives!#REF!,\"<\",\"\")*1)","v":{"$error":"#REF!"}},{"$f":"IF(OR(C31=\"\",B31=\"\"),\"\",IF(AND(B31<=SC_CN,C31<=SC_CN),\"-\",(B31-AVERAGE(B31:C31))/AVERAGE(B31:C31)))","v":{"$error":"#REF!"}},{"$f":"IF(D31=\"\",\"\",IF(D31=\"-\",\"oui\",IF(OR(AND(AVERAGE(B31:C31)>CNfaible,ABS(D31)>3*EMT_CN_forte),AND(AVERAGE(B31:C31)<CNfaible,ABS(D31)>3*EMT_CN_faible)),\"non\",IF(AND(B31<=SC_CN,C31<=SC_CN),\"oui\",IF(AND(AVERAGE(B31:C31)>CNfaible,D31>=-EMT_CN_forte,D31<=EMT_CN_forte),\"oui\",IF(AND(AVERAGE(B31:C31)<=CNfaible,D31>=-EMT_CN_faible,D31<=EMT_CN_faible),\"oui\",\"non\"))))))","v":{"$error":"#REF!"}},{"$f":"IF(ISBLANK(AnalysesComparatives!#REF!),\"\",SUBSTITUTE(AnalysesComparatives!#REF!,\"<\",\"\")*1)","v":{"$error":"#REF!"}},{"$f":"IF(ISBLANK(AnalysesComparatives!#REF!),\"\",SUBSTITUTE(AnalysesComparatives!#REF!,\"<\",\"\")*1)","v":{"$error":"#REF!"}},{"$f":"IF(OR(G31=\"\",F31=\"\"),\"\",IF(AND(F31<=SC_CN,G31<=SC_CN),\"-\",(F31-AVERAGE(F31:G31))/AVERAGE(F31:G31)))","v":{"$error":"#REF!"}},{"$f":"IF(H31=\"\",\"\",IF(H31=\"-\",\"oui\",IF(OR(AND(AVERAGE(F31:G31)>CNfaible,ABS(H31)>3*EMT_CN_forte),AND(AVERAGE(F31:G31)<CNfaible,ABS(H31)>3*EMT_CN_faible)),\"non\",IF(AND(F31<=SC_CN,G31<=SC_CN),\"oui\",IF(AND(AVERAGE(F31:G31)>CNfaible,H31>=-EMT_CN_forte,H31<=EMT_CN_forte),\"oui\",IF(AND(AVERAGE(F31:G31)<=CNfaible,H31>=-EMT_CN_faible,H31<=EMT_CN_faible),\"oui\",\"non\"))))))","v":{"$error":"#REF!"}},{"$f":"IF(ISBLANK(AnalysesComparatives!#REF!),\"\",SUBSTITUTE(AnalysesComparatives!#REF!,\"<\",\"\")*1)","v":{"$error":"#REF!"}},{"$f":"IF(ISBLANK(AnalysesComparatives!#REF!),\"\",SUBSTITUTE(AnalysesComparatives!#REF!,\"<\",\"\")*1)","v":{"$error":"#REF!"}},{"$f":"IF(OR(K31=\"\",J31=\"\"),\"\",IF(AND(J31<=SC_CN,K31<=SC_CN),\"-\",(J31-AVERAGE(J31:K31))/AVERAGE(J31:K31)))","v":{"$error":"#REF!"}},{"$f":"IF(L31=\"\",\"\",IF(L31=\"-\",\"oui\",IF(OR(AND(AVERAGE(J31:K31)>CNfaible,ABS(L31)>3*EMT_CN_forte),AND(AVERAGE(J31:K31)<CNfaible,ABS(L31)>3*EMT_CN_faible)),\"non\",IF(AND(J31<=SC_CN,K31<=SC_CN),\"oui\",IF(AND(AVERAGE(J31:K31)>CNfaible,L31>=-EMT_CN_forte,L31<=EMT_CN_forte),\"oui\",IF(AND(AVERAGE(J31:K31)<=CNfaible,L31>=-EMT_CN_faible,L31<=EMT_CN_faible),\"oui\",\"non\"))))))","v":{"$error":"#REF!"}}]
["AOX",{"$f":"IF(ISBLANK(AnalysesComparatives!#REF!),\"\",SUBSTITUTE(AnalysesComparatives!#REF!,\"<\",\"\")*1)","v":{"$error":"#REF!"}},{"$f":"IF(ISBLANK(AnalysesComparatives!#REF!),\"\",SUBSTITUTE(AnalysesComparatives!#REF!,\"<\",\"\")*1)","v":{"$error":"#REF!"}},{"$f":"IF(OR(C32=\"\",B32=\"\"),\"\",IF(AND(B32<=SC_AOX,C32<=SC_AOX),\"-\",(B32-AVERAGE(B32:C32))/AVERAGE(B32:C32)))","v":{"$error":"#REF!"}},{"$f":"IF(D32=\"\",\"\",IF(D32=\"-\",\"oui\",IF(OR(AND(AVERAGE(B32:C32)>AOXfaible,ABS(D32)>3*EMT_AOX_forte),AND(AVERAGE(B32:C32)<AOXfaible,ABS(D32)>3*EMT_AOX_faible)),\"non\",IF(AND(B32<=SC_AOX,C32<=SC_AOX),\"oui\",IF(AND(AVERAGE(B32:C32)>AOXfaible,D32>=-EMT_AOX_forte,D32<=EMT_AOX_forte),\"oui\",IF(AND(AVERAGE(B32:C32)<=AOXfaible,D32>=-EMT_AOX_faible,D32<=EMT_AOX_faible),\"oui\",\"non\"))))))","v":{"$error":"#REF!"}},{"$f":"IF(ISBLANK(AnalysesComparatives!#REF!),\"\",SUBSTITUTE(AnalysesComparatives!#REF!,\"<\",\"\")*1)","v":{"$error":"#REF!"}},{"$f":"IF(ISBLANK(AnalysesComparatives!#REF!),\"\",SUBSTITUTE(AnalysesComparatives!#REF!,\"<\",\"\")*1)","v":{"$error":"#REF!"}},{"$f":"IF(OR(G32=\"\",F32=\"\"),\"\",IF(AND(F32<=SC_AOX,G32<=SC_AOX),\"-\",(F32-AVERAGE(F32:G32))/AVERAGE(F32:G32)))","v":{"$error":"#REF!"}},{"$f":"IF(H32=\"\",\"\",IF(H32=\"-\",\"oui\",IF(OR(AND(AVERAGE(F32:G32)>AOXfaible,ABS(H32)>3*EMT_AOX_forte),AND(AVERAGE(F32:G32)<AOXfaible,ABS(H32)>3*EMT_AOX_faible)),\"non\",IF(AND(F32<=SC_AOX,G32<=SC_AOX),\"oui\",IF(AND(AVERAGE(F32:G32)>AOXfaible,H32>=-EMT_AOX_forte,H32<=EMT_AOX_forte),\"oui\",IF(AND(AVERAGE(F32:G32)<=AOXfaible,H32>=-EMT_AOX_faible,H32<=EMT_AOX_faible),\"oui\",\"non\"))))))","v":{"$error":"#REF!"}},{"$f":"IF(ISBLANK(AnalysesComparatives!#REF!),\"\",SUBSTITUTE(AnalysesComparatives!#REF!,\"<\",\"\")*1)","v":{"$error":"#REF!"}},{"$f":"IF(ISBLANK(AnalysesComparatives!#REF!),\"\",SUBSTITUTE(AnalysesComparatives!#REF!,\"<\",\"\")*1)","v":{"$error":"#REF!"}},{"$f":"IF(OR(K32=\"\",J32=\"\"),\"\",IF(AND(J32<=SC_AOX,K32<=SC_AOX),\"-\",(J32-AVERAGE(J32:K32))/AVERAGE(J32:K32)))","v":{"$error":"#REF!"}},{"$f":"IF(L32=\"\",\"\",IF(L32=\"-\",\"oui\",IF(OR(AND(AVERAGE(J32:K32)>AOXfaible,ABS(L32)>3*EMT_AOX_forte),AND(AVERAGE(J32:K32)<AOXfaible,ABS(L32)>3*EMT_AOX_faible)),\"non\",IF(AND(J32<=SC_AOX,K32<=SC_AOX),\"oui\",IF(AND(AVERAGE(J32:K32)>AOXfaible,L32>=-EMT_AOX_forte,L32<=EMT_AOX_forte),\"oui\",IF(AND(AVERAGE(J32:K32)<=AOXfaible,L32>=-EMT_AOX_faible,L32<=EMT_AOX_faible),\"oui\",\"non\"))))))","v":{"$error":"#REF!"}}]
["COT",{"$f":"IF(ISBLANK(AnalysesComparatives!#REF!),\"\",SUBSTITUTE(AnalysesComparatives!#REF!,\"<\",\"\")*1)","v":{"$error":"#REF!"}},{"$f":"IF(ISBLANK(AnalysesComparatives!#REF!),\"\",SUBSTITUTE(AnalysesComparatives!#REF!,\"<\",\"\")*1)","v":{"$error":"#REF!"}},{"$f":"IF(OR(C33=\"\",B33=\"\"),\"\",IF(AND(B33<=SC_COT,C33<=SC_COT),\"-\",(B33-AVERAGE(B33:C33))/AVERAGE(B33:C33)))","v":{"$error":"#REF!"}},{"$f":"IF(D33=\"\",\"\",IF(D33=\"-\",\"oui\",IF(OR(AND(AVERAGE(B33:C33)>COTfaible,ABS(D33)>3*EMT_COT_forte),AND(AVERAGE(B33:C33)<COTfaible,ABS(D33)>3*EMT_COT_faible)),\"non\",IF(AND(B33<=SC_COT,C33<=SC_COT),\"oui\",IF(AND(AVERAGE(B33:C33)>COTfaible,D33>=-EMT_COT_forte,D33<=EMT_COT_forte),\"oui\",IF(AND(AVERAGE(B33:C33)<=COTfaible,D33>=-EMT_COT_faible,D33<=EMT_COT_faible),\"oui\",\"non\"))))))","v":{"$error":"#REF!"}},{"$f":"IF(ISBLANK(AnalysesComparatives!#REF!),\"\",SUBSTITUTE(AnalysesComparatives!#REF!,\"<\",\"\")*1)","v":{"$error":"#REF!"}},{"$f":"IF(ISBLANK(AnalysesComparatives!#REF!),\"\",SUBSTITUTE(AnalysesComparatives!#REF!,\"<\",\"\")*1)","v":{"$error":"#REF!"}},{"$f":"IF(OR(G33=\"\",F33=\"\"),\"\",IF(AND(F33<=SC_COT,G33<=SC_COT),\"-\",(F33-AVERAGE(F33:G33))/AVERAGE(F33:G33)))","v":{"$error":"#REF!"}},{"$f":"IF(H33=\"\",\"\",IF(H33=\"-\",\"oui\",IF(OR(AND(AVERAGE(F33:G33)>COTfaible,ABS(H33)>3*EMT_COT_forte),AND(AVERAGE(F33:G33)<COTfaible,ABS(H33)>3*EMT_COT_faible)),\"non\",IF(AND(F33<=SC_COT,G33<=SC_COT),\"oui\",IF(AND(AVERAGE(F33:G33)>COTfaible,H33>=-EMT_COT_forte,H33<=EMT_COT_forte),\"oui\",IF(AND(AVERAGE(F33:G33)<=COTfaible,H33>=-EMT_COT_faible,H33<=EMT_COT_faible),\"oui\",\"non\"))))))","v":{"$error":"#REF!"}},{"$f":"IF(ISBLANK(AnalysesComparatives!#REF!),\"\",SUBSTITUTE(AnalysesComparatives!#REF!,\"<\",\"\")*1)","v":{"$error":"#REF!"}},{"$f":"IF(ISBLANK(AnalysesComparatives!#REF!),\"\",SUBSTITUTE(AnalysesComparatives!#REF!,\"<\",\"\")*1)","v":{"$error":"#REF!"}},{"$f":"IF(OR(K33=\"\",J33=\"\"),\"\",IF(AND(J33<=SC_COT,K33<=SC_COT),\"-\",(J33-AVERAGE(J33:K33))/AVERAGE(J33:K33)))","v":{"$error":"#REF!"}},{"$f":"IF(L33=\"\",\"\",IF(L33=\"-\",\"oui\",IF(OR(AND(AVERAGE(J33:K33)>COTfaible,ABS(L33)>3*EMT_COT_forte),AND(AVERAGE(J33:K33)<COTfaible,ABS(L33)>3*EMT_COT_faible)),\"non\",IF(AND(J33<=SC_COT,K33<=SC_COT),\"oui\",IF(AND(AVERAGE(J33:K33)>COTfaible,L33>=-EMT_COT_forte,L33<=EMT_COT_forte),\"oui\",IF(AND(AVERAGE(J33:K33)<=COTfaible,L33>=-EMT_COT_faible,L33<=EMT_COT_faible),\"oui\",\"non\"))))))","v":{"$error":"#REF!"}}]
["Mi",{"$f":"IF(ISBLANK(AnalysesComparatives!#REF!),\"\",SUBSTITUTE(AnalysesComparatives!#REF!,\"<\",\"\")*1)","v":{"$error":"#REF!"}},{"$f":"IF(ISBLANK(AnalysesComparatives!#REF!),\"\",SUBSTITUTE(AnalysesComparatives!#REF!,\"<\",\"\")*1)","v":{"$error":"#REF!"}},{"$f":"IF(OR(C34=\"\",B34=\"\"),\"\",IF(AND(B34<=SC_Mi,C34<=SC_Mi),\"-\",(B34-AVERAGE(B34:C34))/AVERAGE(B34:C34)))","v":{"$error":"#REF!"}},{"$f":"IF(D34=\"\",\"\",IF(D34=\"-\",\"oui\",IF(OR(AND(AVERAGE(B34:C34)>Mifaible,ABS(D34)>3*EMT_Mi_forte),AND(AVERAGE(B34:C34)<Mifaible,ABS(D34)>3*EMT_Mi_faible)),\"non\",IF(AND(B34<=SC_Mi,C34<=SC_Mi),\"oui\",IF(AND(AVERAGE(B34:C34)>Mifaible,D34>=-EMT_Mi_forte,D34<=EMT_Mi_forte),\"oui\",IF(AND(AVERAGE(B34:C34)<=Mifaible,D34>=-EMT_Mi_faible,D34<=EMT_Mi_faible),\"oui\",\"non\"))))))","v":{"$error":"#REF!"}},{"$f":"IF(ISBLANK(AnalysesComparatives!#REF!),\"\",SUBSTITUTE(AnalysesComparatives!#REF!,\"<\",\"\")*1)","v":{"$error":"#REF!"}},{"$f":"IF(ISBLANK(AnalysesComparatives!#REF!),\"\",SUBSTITUTE(AnalysesComparatives!#REF!,\"<\",\"\")*1)","v":{"$error":"#REF!"}},{"$f":"IF(OR(G34=\"\",F34=\"\"),\"\",IF(AND(F34<=SC_Mi,G34<=SC_Mi),\"-\",(F34-AVERAGE(F34:G34))/AVERAGE(F34:G34)))","v":{"$error":"#REF!"}},{"$f":"IF(H34=\"\",\"\",IF(H34=\"-\",\"oui\",IF(OR(AND(AVERAGE(F34:G34)>Mifaible,ABS(H34)>3*EMT_Mi_forte),AND(AVERAGE(F34:G34)<Mifaible,ABS(H34)>3*EMT_Mi_faible)),\"non\",IF(AND(F34<=SC_Mi,G34<=SC_Mi),\"oui\",IF(AND(AVERAGE(F34:G34)>Mifaible,H34>=-EMT_Mi_forte,H34<=EMT_Mi_forte),\"oui\",IF(AND(AVERAGE(F34:G34)<=Mifaible,H34>=-EMT_Mi_faible,H34<=EMT_Mi_faible),\"oui\",\"non\"))))))","v":{"$error":"#REF!"}},{"$f":"IF(ISBLANK(AnalysesComparatives!#REF!),\"\",SUBSTITUTE(AnalysesComparatives!#REF!,\"<\",\"\")*1)","v":{"$error":"#REF!"}},{"$f":"IF(ISBLANK(AnalysesComparatives!#REF!),\"\",SUBSTITUTE(AnalysesComparatives!#REF!,\"<\",\"\")*1)","v":{"$error":"#REF!"}},{"$f":"IF(OR(K34=\"\",J34=\"\"),\"\",IF(AND(J34<=SC_Mi,K34<=SC_Mi),\"-\",(J34-AVERAGE(J34:K34))/AVERAGE(J34:K34)))","v":{"$error":"#REF!"}},{"$f":"IF(L34=\"\",\"\",IF(L34=\"-\",\"oui\",IF(OR(AND(AVERAGE(J34:K34)>Mifaible,ABS(L34)>3*EMT_Mi_forte),AND(AVERAGE(J34:K34)<Mifaible,ABS(L34)>3*EMT_Mi_faible)),\"non\",IF(AND(J34<=SC_Mi,K34<=SC_Mi),\"oui\",IF(AND(AVERAGE(J34:K34)>Mifaible,L34>=-EMT_Mi_forte,L34<=EMT_Mi_forte),\"oui\",IF(AND(AVERAGE(J34:K34)<=Mifaible,L34>=-EMT_Mi_faible,L34<=EMT_Mi_faible),\"oui\",\"non\"))))))","v":{"$error":"#REF!"}}]
["autre para.",{"$f":"IF(ISBLANK(AnalysesComparatives!#REF!),\"\",SUBSTITUTE(AnalysesComparatives!#REF!,\"<\",\"\")*1)","v":{"$error":"#REF!"}},{"$f":"IF(ISBLANK(AnalysesComparatives!#REF!),\"\",SUBSTITUTE(AnalysesComparatives!#REF!,\"<\",\"\")*1)","v":{"$error":"#REF!"}},{"$f":"IF(AND(C35<>\"\",B35<>\"\"),((B35-AVERAGE(B35:C35))/AVERAGE(B35:C35)),\"\")","v":{"$error":"#REF!"}},{"$f":"IF(D35=\"\",\"\",IF(D35=\"-\",\"oui\",IF(OR(AND(AVERAGE(B35:C35)>COTfaible,ABS(D35)>3*EMT_COT_forte),AND(AVERAGE(B35:C35)<COTfaible,ABS(D35)>3*EMT_COT_faible)),\"non\",IF(AND(B35<=SC_COT,C35<=SC_COT),\"oui\",IF(AND(AVERAGE(B35:C35)>COTfaible,D35>=-EMT_COT_forte,D35<=EMT_COT_forte),\"oui\",IF(AND(AVERAGE(B35:C35)<=COTfaible,D35>=-EMT_COT_faible,D35<=EMT_COT_faible),\"oui\",\"non\"))))))","v":{"$error":"#REF!"}},{"$f":"IF(ISBLANK(AnalysesComparatives!#REF!),\"\",SUBSTITUTE(AnalysesComparatives!#REF!,\"<\",\"\")*1)","v":{"$error":"#REF!"}},{"$f":"IF(ISBLANK(AnalysesComparatives!#REF!),\"\",SUBSTITUTE(AnalysesComparatives!#REF!,\"<\",\"\")*1)","v":{"$error":"#REF!"}},{"$f":"IF(AND(G35<>\"\",F35<>\"\"),((F35-AVERAGE(F35:G35))/AVERAGE(F35:G35)),\"\")","v":{"$error":"#REF!"}},{"$f":"IF(H35=\"\",\"\",IF(H35=\"-\",\"oui\",IF(OR(AND(AVERAGE(F35:G35)>COTfaible,ABS(H35)>3*EMT_COT_forte),AND(AVERAGE(F35:G35)<COTfaible,ABS(H35)>3*EMT_COT_faible)),\"non\",IF(AND(F35<=SC_COT,G35<=SC_COT),\"oui\",IF(AND(AVERAGE(F35:G35)>COTfaible,H35>=-EMT_COT_forte,H35<=EMT_COT_forte),\"oui\",IF(AND(AVERAGE(F35:G35)<=COTfaible,H35>=-EMT_COT_faible,H35<=EMT_COT_faible),\"oui\",\"non\"))))))","v":{"$error":"#REF!"}},{"$f":"IF(ISBLANK(AnalysesComparatives!#REF!),\"\",SUBSTITUTE(AnalysesComparatives!#REF!,\"<\",\"\")*1)","v":{"$error":"#REF!"}},{"$f":"IF(ISBLANK(AnalysesComparatives!#REF!),\"\",SUBSTITUTE(AnalysesComparatives!#REF!,\"<\",\"\")*1)","v":{"$error":"#REF!"}},{"$f":"IF(AND(K35<>\"\",J35<>\"\"),((J35-AVERAGE(J35:K35))/AVERAGE(J35:K35)),\"\")","v":{"$error":"#REF!"}},{"$f":"IF(L35=\"\",\"\",IF(L35=\"-\",\"oui\",IF(OR(AND(AVERAGE(J35:K35)>COTfaible,ABS(L35)>3*EMT_COT_forte),AND(AVERAGE(J35:K35)<COTfaible,ABS(L35)>3*EMT_COT_faible)),\"non\",IF(AND(J35<=SC_COT,K35<=SC_COT),\"oui\",IF(AND(AVERAGE(J35:K35)>COTfaible,L35>=-EMT_COT_forte,L35<=EMT_COT_forte),\"oui\",IF(AND(AVERAGE(J35:K35)<=COTfaible,L35>=-EMT_COT_faible,L35<=EMT_COT_faible),\"oui\",\"non\"))))))","v":{"$error":"#REF!"}}]
[]
["Dénomination des points d'autosurveillance"]
[null,"Entrée",null,null,null,"Entrée",null,null,null,"Entrée"]
["paramètres","Station\nOU Etabliss","Labo\n de contrôle.","Ecart","Conformité","Station\nOU Etabliss","Labo\n de contrôle.","Ecart","Conformité","Station\nOU Etabliss","Labo\n de contrôle.","Ecart","Conformité"]
["DBO5",{"$f":"IF(ISBLANK(AnalysesComparatives!#REF!),\"\",SUBSTITUTE(AnalysesComparatives!#REF!,\"<\",\"\")*1)","v":{"$error":"#REF!"}},{"$f":"IF(ISBLANK(AnalysesComparatives!#REF!),\"\",SUBSTITUTE(AnalysesComparatives!#REF!,\"<\",\"\")*1)","v":{"$error":"#REF!"}},{"$f":"IF(OR(C40=\"\",B40=\"\"),\"\",IF(AND(B40<=SC_DBO5,C40<=SC_DBO5),\"-\",(B40-AVERAGE(B40:C40))/AVERAGE(B40:C40)))","v":{"$error":"#REF!"}},{"$f":"IF(D40=\"\",\"\",IF(D40=\"-\",\"oui\",IF(OR(AND(AVERAGE(B40:C40)>DBO5faible,ABS(D40)>3*EMT_DBO5_forte),AND(AVERAGE(B40:C40)<DBO5faible,ABS(D40)>3*EMT_DBO5_faible)),\"non\",IF(AND(B40<=SC_DBO5,C40<=SC_DBO5),\"oui\",IF(AND(AVERAGE(B40:C40)>DBO5faible,D40>=-EMT_DBO5_forte,D40<=EMT_DBO5_forte),\"oui\",IF(AND(AVERAGE(B40:C40)<=DBO5faible,D40>=-EMT_DBO5_faible,D40<=EMT_DBO5_faible),\"oui\",\"non\"))))))","v":{"$error":"#REF!"}},{"$f":"IF(ISBLANK(AnalysesComparatives!#REF!),\"\",SUBSTITUTE(AnalysesComparatives!#REF!,\"<\",\"\")*1)","v":{"$error":"#REF!"}},{"$f":"IF(ISBLANK(AnalysesComparatives!#REF!),\"\",SUBSTITUTE(AnalysesComparatives!#REF!,\"<\",\"\")*1)","v":{"$error":"#REF!"}},{"$f":"IF(OR(G40=\"\",F40=\"\"),\"\",IF(AND(F40<=SC_DBO5,G40<=SC_DBO5),\"-\",(F40-AVERAGE(F40:G40))/AVERAGE(F40:G40)))","v":{"$error":"#REF!"}},{"$f":"IF(H40=\"\",\"\",IF(H40=\"-\",\"oui\",IF(OR(AND(AVERAGE(F40:G40)>DBO5faible,ABS(H40)>3*EMT_DBO5_forte),AND(AVERAGE(F40:G40)<DBO5faible,ABS(H40)>3*EMT_DBO5_faible)),\"non\",IF(AND(F40<=SC_DBO5,G40<=SC_DBO5),\"oui\",IF(AND(AVERAGE(F40:G40)>DBO5faible,H40>=-EMT_DBO5_forte,H40<=EMT_DBO5_forte),\"oui\",IF(AND(AVERAGE(F40:G40)<=DBO5faible,H40>=-EMT_DBO5_faible,H40<=EMT_DBO5_faible),\"oui\",\"non\"))))))","v":{"$error":"#REF!"}},{"$f":"IF(ISBLANK(AnalysesComparatives!#REF!),\"\",SUBSTITUTE(AnalysesComparatives!#REF!,\"<\",\"\")*1)","v":{"$error":"#REF!"}},{"$f":"IF(ISBLANK(AnalysesComparatives!#REF!),\"\",SUBSTITUTE(AnalysesComparatives!#REF!,\"<\",\"\")*1)","v":{"$error":"#REF!"}},{"$f":"IF(OR(K40=\"\",J40=\"\"),\"\",IF(AND(J40<=SC_DBO5,K40<=SC_DBO5),\"-\",(J40-AVERAGE(J40:K40))/AVERAGE(J40:K40)))","v":{"$error":"#REF!"}},{"$f":"IF(L40=\"\",\"\",IF(L40=\"-\",\"oui\",IF(OR(AND(AVERAGE(J40:K40)>DBO5faible,ABS(L40)>3*EMT_DBO5_forte),AND(AVERAGE(J40:K40)<DBO5faible,ABS(L40)>3*EMT_DBO5_faible)),\"non\",IF(AND(J40<=SC_DBO5,K40<=SC_DBO5),\"oui\",IF(AND(AVERAGE(J40:K40)>DBO5faible,L40>=-EMT_DBO5_forte,L40<=EMT_DBO5_forte),\"oui\",IF(AND(AVERAGE(J40:K40)<=DBO5faible,L40>=-EMT_DBO5_faible,L40<=EMT_DBO5_faible),\"oui\",\"non\"))))))","v":{"$error":"#REF!"}}]
["DCO",{"$f":"IF(ISBLANK(AnalysesComparatives!#REF!),\"\",SUBSTITUTE(AnalysesComparatives!#REF!,\"<\",\"\")*1)","v":{"$error":"#REF!"}},{"$f":"IF(ISBLANK(AnalysesComparatives!#REF!),\"\",SUBSTITUTE(AnalysesComparatives!#REF!,\"<\",\"\")*1)","v":{"$error":"#REF!"}},{"$f":"IF(OR(C41=\"\",B41=\"\"),\"\",IF(AND(B41<=SC_DCO,C41<=SC_DCO),\"-\",(B41-AVERAGE(B41:C41))/AVERAGE(B41:C41)))","v":{"$error":"#REF!"}},{"$f":"IF(D41=\"\",\"\",IF(D41=\"-\",\"oui\",IF(OR(AND(AVERAGE(B41:C41)>DCOfaible,ABS(D41)>3*EMT_DCO_forte),AND(AVERAGE(B41:C41)<DCOfaible,ABS(D41)>3*EMT_DCO_faible)),\"non\",IF(AND(B41<=SC_DCO,C41<=SC_DCO),\"oui\",IF(AND(AVERAGE(B41:C41)>DCOfaible,D41>=-EMT_DCO_forte,D41<=EMT_DCO_forte),\"oui\",IF(AND(AVERAGE(B41:C41)<=DCOfaible,D41>=-EMT_DCO_faible,D41<=EMT_DCO_faible),\"oui\",\"non\"))))))","v":{"$error":"#REF!"}},{"$f":"IF(ISBLANK(AnalysesComparatives!#REF!),\"\",SUBSTITUTE(AnalysesComparatives!#REF!,\"<\",\"\")*1)","v":{"$error":"#REF!"}},{"$f":"IF(ISBLANK(AnalysesComparatives!#REF!),\"\",SUBSTITUTE(AnalysesComparatives!#REF!,\"<\",\"\")*1)","v":{"$error":"#REF!"}},{"$f":"IF(OR(G41=\"\",F41=\"\"),\"\",IF(AND(F41<=SC_DCO,G41<=SC_DCO),\"-\",(F41-AVERAGE(F41:G41))/AVERAGE(F41:G41)))","v":{"$error":"#REF!"}},{"$f":"IF(H41=\"\",\"\",IF(H41=\"-\",\"oui\",IF(OR(AND(AVERAGE(F41:G41)>DCOfaible,ABS(H41)>3*EMT_DCO_forte),AND(AVERAGE(F41:G41)<DCOfaible,ABS(H41)>3*EMT_DCO_faible)),\"non\",IF(AND(F41<=SC_DCO,G41<=SC_DCO),\"oui\",IF(AND(AVERAGE(F41:G41)>DCOfaible,H41>=-EMT_DCO_forte,H41<=EMT_DCO_forte),\"oui\",IF(AND(AVERAGE(F41:G41)<=DCOfaible,H41>=-EMT_DCO_faible,H41<=EMT_DCO_faible),\"oui\",\"non\"))))))","v":{"$error":"#REF!"}},{"$f":"IF(ISBLANK(AnalysesComparatives!#REF!),\"\",SUBSTITUTE(AnalysesComparatives!#REF!,\"<\",\"\")*1)","v":{"$error":"#REF!"}},{"$f":"IF(ISBLANK(AnalysesComparatives!#REF!),\"\",SUBSTITUTE(AnalysesComparatives!#REF!,\"<\",\"\")*1)","v":{"$error":"#REF!"}},{"$f":"IF(OR(K41=\"\",J41=\"\"),\"\",IF(AND(J41<=SC_DCO,K41<=SC_DCO),\"-\",(J41-AVERAGE(J41:K41))/AVERAGE(J41:K41)))","v":{"$error":"#REF!"}},{"$f":"IF(L41=\"\",\"\",IF(L41=\"-\",\"oui\",IF(OR(AND(AVERAGE(J41:K41)>DCOfaible,ABS(L41)>3*EMT_DCO_forte),AND(AVERAGE(J41:K41)<DCOfaible,ABS(L41)>3*EMT_DCO_faible)),\"non\",IF(AND(J41<=SC_DCO,K41<=SC_DCO),\"oui\",IF(AND(AVERAGE(J41:K41)>DCOfaible,L41>=-EMT_DCO_forte,L41<=EMT_DCO_forte),\"oui\",IF(AND(AVERAGE(J41:K41)<=DCOfaible,L41>=-EMT_DCO_faible,L41<=EMT_DCO_faible),\"oui\",\"non\"))))))","v":{"$error":"#REF!"}}]
["MES",{"$f":"IF(ISBLANK(AnalysesComparatives!#REF!),\"\",SUBSTITUTE(AnalysesComparatives!#REF!,\"<\",\"\")*1)","v":{"$error":"#REF!"}},{"$f":"IF(ISBLANK(AnalysesComparatives!#REF!),\"\",SUBSTITUTE(AnalysesComparatives!#REF!,\"<\",\"\")*1)","v":{"$error":"#REF!"}},{"$f":"IF(OR(C42=\"\",B42=\"\"),\"\",IF(AND(B42<=SC_MEST,C42<=SC_MEST),\"-\",(B42-AVERAGE(B42:C42))/AVERAGE(B42:C42)))","v":{"$error":"#REF!"}},{"$f":"IF(D42=\"\",\"\",IF(D42=\"-\",\"oui\",IF(OR(AND(AVERAGE(B42:C42)>MESTfaible,ABS(D42)>3*EMT_MEST_forte),AND(AVERAGE(B42:C42)<MESTfaible,ABS(D42)>3*EMT_MEST_faible)),\"non\",IF(AND(B42<=SC_MEST,C42<=SC_MEST),\"oui\",IF(AND(AVERAGE(B42:C42)>MESTfaible,D42>=-EMT_MEST_forte,D42<=EMT_MEST_forte),\"oui\",IF(AND(AVERAGE(B42:C42)<=MESTfaible,D42>=-EMT_MEST_faible,D42<=EMT_MEST_faible),\"oui\",\"non\"))))))","v":{"$error":"#REF!"}},{"$f":"IF(ISBLANK(AnalysesComparatives!#REF!),\"\",SUBSTITUTE(AnalysesComparatives!#REF!,\"<\",\"\")*1)","v":{"$error":"#REF!"}},{"$f":"IF(ISBLANK(AnalysesComparatives!#REF!),\"\",SUBSTITUTE(AnalysesComparatives!#REF!,\"<\",\"\")*1)","v":{"$error":"#REF!"}},{"$f":"IF(OR(G42=\"\",F42=\"\"),\"\",IF(AND(F42<=SC_MEST,G42<=SC_MEST),\"-\",(F42-AVERAGE(F42:G42))/AVERAGE(F42:G42)))","v":{"$error":"#REF!"}},{"$f":"IF(H42=\"\",\"\",IF(H42=\"-\",\"oui\",IF(OR(AND(AVERAGE(F42:G42)>MESTfaible,ABS(H42)>3*EMT_MEST_forte),AND(AVERAGE(F42:G42)<MESTfaible,ABS(H42)>3*EMT_MEST_faible)),\"non\",IF(AND(F42<=SC_MEST,G42<=SC_MEST),\"oui\",IF(AND(AVERAGE(F42:G42)>MESTfaible,H42>=-EMT_MEST_forte,H42<=EMT_MEST_forte),\"oui\",IF(AND(AVERAGE(F42:G42)<=MESTfaible,H42>=-EMT_MEST_faible,H42<=EMT_MEST_faible),\"oui\",\"non\"))))))","v":{"$error":"#REF!"}},{"$f":"IF(ISBLANK(AnalysesComparatives!#REF!),\"\",SUBSTITUTE(AnalysesComparatives!#REF!,\"<\",\"\")*1)","v":{"$error":"#REF!"}},{"$f":"IF(ISBLANK(AnalysesComparatives!#REF!),\"\",SUBSTITUTE(AnalysesComparatives!#REF!,\"<\",\"\")*1)","v":{"$error":"#REF!"}},{"$f":"IF(OR(K42=\"\",J42=\"\"),\"\",IF(AND(J42<=SC_MEST,K42<=SC_MEST),\"-\",(J42-AVERAGE(J42:K42))/AVERAGE(J42:K42)))","v":{"$error":"#REF!"}},{"$f":"IF(L42=\"\",\"\",IF(L42=\"-\",\"oui\",IF(OR(AND(AVERAGE(J42:K42)>MESTfaible,ABS(L42)>3*EMT_MEST_forte),AND(AVERAGE(J42:K42)<MESTfaible,ABS(L42)>3*EMT_MEST_faible)),\"non\",IF(AND(J42<=SC_MEST,K42<=SC_MEST),\"oui\",IF(AND(AVERAGE(J42:K42)>MESTfaible,L42>=-EMT_MEST_forte,L42<=EMT_MEST_forte),\"oui\",IF(AND(AVERAGE(J42:K42)<=MESTfaible,L42>=-EMT_MEST_faible,L42<=EMT_MEST_faible),\"oui\",\"non\"))))))","v":{"$error":"#REF!"}}]
["Nk",{"$f":"IF(ISBLANK(AnalysesComparatives!#REF!),\"\",SUBSTITUTE(AnalysesComparatives!#REF!,\"<\",\"\")*1)","v":{"$error":"#REF!"}},{"$f":"IF(ISBLANK(AnalysesComparatives!#REF!),\"\",SUBSTITUTE(AnalysesComparatives!#REF!,\"<\",\"\")*1)","v":{"$error":"#REF!"}},{"$f":"IF(OR(C43=\"\",B43=\"\"),\"\",IF(AND(B43<=SC_Nk,C43<=SC_Nk),\"-\",(B43-AVERAGE(B43:C43))/AVERAGE(B43:C43)))","v":{"$error":"#REF!"}},{"$f":"IF(D43=\"\",\"\",IF(D43=\"-\",\"oui\",IF(OR(AND(AVERAGE(B43:C43)>Nkfaible,ABS(D43)>3*EMT_Nk_forte),AND(AVERAGE(B43:C43)<Nkfaible,ABS(D43)>3*EMT_Nk_faible)),\"non\",IF(AND(B43<=SC_Nk,C43<=SC_Nk),\"non\",IF(AND(AVERAGE(B43:C43)>Nkfaible,D43>=-EMT_Nk_forte,D43<=EMT_Nk_forte),\"oui\",IF(AND(AVERAGE(B43:C43)<=Nkfaible,D43>=-EMT_Nk_faible,D43<=EMT_Nk_faible),\"oui\",\"non\"))))))","v":{"$error":"#REF!"}},{"$f":"IF(ISBLANK(AnalysesComparatives!#REF!),\"\",SUBSTITUTE(AnalysesComparatives!#REF!,\"<\",\"\")*1)","v":{"$error":"#REF!"}},{"$f":"IF(ISBLANK(AnalysesComparatives!#REF!),\"\",SUBSTITUTE(AnalysesComparatives!#REF!,\"<\",\"\")*1)","v":{"$error":"#REF!"}},{"$f":"IF(OR(G43=\"\",F43=\"\"),\"\",IF(AND(F43<=SC_Nk,G43<=SC_Nk),\"-\",(F43-AVERAGE(F43:G43))/AVERAGE(F43:G43)))","v":{"$error":"#REF!"}},{"$f":"IF(H43=\"\",\"\",IF(H43=\"-\",\"oui\",IF(OR(AND(AVERAGE(F43:G43)>Nkfaible,ABS(H43)>3*EMT_Nk_forte),AND(AVERAGE(F43:G43)<Nkfaible,ABS(H43)>3*EMT_Nk_faible)),\"non\",IF(AND(F43<=SC_Nk,G43<=SC_Nk),\"non\",IF(AND(AVERAGE(F43:G43)>Nkfaible,H43>=-EMT_Nk_forte,H43<=EMT_Nk_forte),\"oui\",IF(AND(AVERAGE(F43:G43)<=Nkfaible,H43>=-EMT_Nk_faible,H43<=EMT_Nk_faible),\"oui\",\"non\"))))))","v":{"$error":"#REF!"}},{"$f":"IF(ISBLANK(AnalysesComparatives!#REF!),\"\",SUBSTITUTE(AnalysesComparatives!#REF!,\"<\",\"\")*1)","v":{"$error":"#REF!"}},{"$f":"IF(ISBLANK(AnalysesComparatives!#REF!),\"\",SUBSTITUTE(AnalysesComparatives!#REF!,\"<\",\"\")*1)","v":{"$error":"#REF!"}},{"$f":"IF(OR(K43=\"\",J43=\"\"),\"\",IF(AND(J43<=SC_Nk,K43<=SC_Nk),\"-\",(J43-AVERAGE(J43:K43))/AVERAGE(J43:K43)))","v":{"$error":"#REF!"}},{"$f":"IF(L43=\"\",\"\",IF(L43=\"-\",\"oui\",IF(OR(AND(AVERAGE(J43:K43)>Nkfaible,ABS(L43)>3*EMT_Nk_forte),AND(AVERAGE(J43:K43)<Nkfaible,ABS(L43)>3*EMT_Nk_faible)),\"non\",IF(AND(J43<=SC_Nk,K43<=SC_Nk),\"non\",IF(AND(AVERAGE(J43:K43)>Nkfaible,L43>=-EMT_Nk_forte,L43<=EMT_Nk_forte),\"oui\",IF(AND(AVERAGE(J43:K43)<=Nkfaible,L43>=-EMT_Nk_faible,L43<=EMT_Nk_faible),\"oui\",\"non\"))))))","v":{"$error":"#REF!"}}]
["NH4",{"$f":"IF(ISBLANK(AnalysesComparatives!#REF!),\"\",SUBSTITUTE(AnalysesComparatives!#REF!,\"<\",\"\")*1)","v":{"$error":"#REF!"}},{"$f":"IF(ISBLANK(AnalysesComparatives!#REF!),\"\",SUBSTITUTE(AnalysesComparatives!#REF!,\"<\",\"\")*1)","v":{"$error":"#REF!"}},{"$f":"IF(OR(C44=\"\",B44=\"\"),\"\",IF(AND(B44<=SC_NH4,C44<=SC_NH4),\"-\",(B44-AVERAGE(B44:C44))/AVERAGE(B44:C44)))","v":{"$error":"#REF!"}},{"$f":"IF(D44=\"\",\"\",IF(D44=\"-\",\"oui\",IF(OR(AND(AVERAGE(B44:C44)>NH4faible,ABS(D44)>3*EMT_NH4_forte),AND(AVERAGE(B44:C44)<NH4faible,ABS(D44)>3*EMT_NH4_faible)),\"non\",IF(AND(B44<=SC_NH4,C44<=SC_NH4),\"oui\",IF(AND(AVERAGE(B44:C44)>NH4faible,D44>=-EMT_NH4_forte,D44<=EMT_NH4_forte),\"oui\",IF(AND(AVERAGE(B44:C44)<=NH4faible,D44>=-EMT_NH4_faible,D44<=EMT_NH4_faible),\"oui\",\"non\"))))))","v":{"$error":"#REF!"}},{"$f":"IF(ISBLANK(AnalysesComparatives!#REF!),\"\",SUBSTITUTE(AnalysesComparatives!#REF!,\"<\",\"\")*1)","v":{"$error":"#REF!"}},{"$f":"IF(ISBLANK(AnalysesComparatives!#REF!),\"\",SUBSTITUTE(AnalysesComparatives!#REF!,\"<\",\"\")*1)","v":{"$error":"#REF!"}},{"$f":"IF(OR(G44=\"\",F44=\"\"),\"\",IF(AND(F44<=SC_NH4,G44<=SC_NH4),\"-\",(F44-AVERAGE(F44:G44))/AVERAGE(F44:G44)))","v":{"$error":"#REF!"}},{"$f":"IF(H44=\"\",\"\",IF(H44=\"-\",\"oui\",IF(OR(AND(AVERAGE(F44:G44)>NH4faible,ABS(H44)>3*EMT_NH4_forte),AND(AVERAGE(F44:G44)<NH4faible,ABS(H44)>3*EMT_NH4_faible)),\"non\",IF(AND(F44<=SC_NH4,G44<=SC_NH4),\"oui\",IF(AND(AVERAGE(F44:G44)>NH4faible,H44>=-EMT_NH4_forte,H44<=EMT_NH4_forte),\"oui\",IF(AND(AVERAGE(F44:G44)<=NH4faible,H44>=-EMT_NH4_faible,H44<=EMT_NH4_faible),\"oui\",\"non\"))))))","v":{"$error":"#REF!"}},{"$f":"IF(ISBLANK(AnalysesComparatives!#REF!),\"\",SUBSTITUTE(AnalysesComparatives!#REF!,\"<\",\"\")*1)","v":{"$error":"#REF!"}},{"$f":"IF(ISBLANK(AnalysesComparatives!#REF!),\"\",SUBSTITUTE(AnalysesComparatives!#REF!,\"<\",\"\")*1)","v":{"$error":"#REF!"}},{"$f":"IF(OR(K44=\"\",J44=\"\"),\"\",IF(AND(J44<=SC_NH4,K44<=SC_NH4),\"-\",(J44-AVERAGE(J44:K44))/AVERAGE(J44:K44)))","v":{"$error":"#REF!"}},{"$f":"IF(L44=\"\",\"\",IF(L44=\"-\",\"oui\",IF(OR(AND(AVERAGE(J44:K44)>NH4faible,ABS(L44)>3*EMT_NH4_forte),AND(AVERAGE(J44:K44)<NH4faible,ABS(L44)>3*EMT_NH4_faible)),\"non\",IF(AND(J44<=SC_NH4,K44<=SC_NH4),\"oui\",IF(AND(AVERAGE(J44:K44)>NH4faible,L44>=-EMT_NH4_forte,L44<=EMT_NH4_forte),\"oui\",IF(AND(AVERAGE(J44:K44)<=NH4faible,L44>=-EMT_NH4_faible,L44<=EMT_NH4_faible),\"oui\",\"non\"))))))","v":{"$error":"#REF!"}}]
["NO2",{"$f":"IF(ISBLANK(AnalysesComparatives!#REF!),\"\",SUBSTITUTE(AnalysesComparatives!#REF!,\"<\",\"\")*1)","v":{"$error":"#REF!"}},{"$f":"IF(ISBLANK(AnalysesComparatives!#REF!),\"\",SUBSTITUTE(AnalysesComparatives!#REF!,\"<\",\"\")*1)","v":{"$error":"#REF!"}},{"$f":"IF(OR(C45=\"\",B45=\"\"),\"\",IF(AND(B45<=SC_NO2,C45<=SC_NO2),\"-\",(B45-AVERAGE(B45:C45))/AVERAGE(B45:C45)))","v":{"$error":"#REF!"}},{"$f":"IF(D45=\"\",\"\",IF(D45=\"-\",\"oui\",IF(OR(AND(AVERAGE(B45:C45)>NO2faible,ABS(D45)>3*EMT_NO2_forte),AND(AVERAGE(B45:C45)<NO2faible,ABS(D45)>3*EMT_NO2_faible)),\"non\",IF(AND(B45<=SC_NO2,C45<=SC_NO2),\"oui\",IF(AND(AVERAGE(B45:C45)>NO2faible,D45>=-EMT_NO2_forte,D45<=EMT_NO2_forte),\"oui\",IF(AND(AVERAGE(B45:C45)<=NO2faible,D45>=-EMT_NO2_faible,D45<=EMT_NO2_faible),\"oui\",\"non\"))))))","v":{"$error":"#REF!"}},{"$f":"IF(ISBLANK(AnalysesComparatives!#REF!),\"\",SUBSTITUTE(AnalysesComparatives!#REF!,\"<\",\"\")*1)","v":{"$error":"#REF!"}},{"$f":"IF(ISBLANK(AnalysesComparatives!#REF!),\"\",SUBSTITUTE(AnalysesComparatives!#REF!,\"<\",\"\")*1)","v":{"$error":"#REF!"}},{"$f":"IF(OR(G45=\"\",F45=\"\"),\"\",IF(AND(F45<=SC_NO2,G45<=SC_NO2),\"-\",(F45-AVERAGE(F45:G45))/AVERAGE(F45:G45)))","v":{"$error":"#REF!"}},{"$f":"IF(H45=\"\",\"\",IF(H45=\"-\",\"oui\",IF(OR(AND(AVERAGE(F45:G45)>NO2faible,ABS(H45)>3*EMT_NO2_forte),AND(AVERAGE(F45:G45)<NO2faible,ABS(H45)>3*EMT_NO2_faible)),\"non\",IF(AND(F45<=SC_NO2,G45<=SC_NO2),\"oui\",IF(AND(AVERAGE(F45:G45)>NO2faible,H45>=-EMT_NO2_forte,H45<=EMT_NO2_forte),\"oui\",IF(AND(AVERAGE(F45:G45)<=NO2faible,H45>=-EMT_NO2_faible,H45<=EMT_NO2_faible),\"oui\",\"non\"))))))","v":{"$error":"#REF!"}},{"$f":"IF(ISBLANK(AnalysesComparatives!#REF!),\"\",SUBSTITUTE(AnalysesComparatives!#REF!,\"<\",\"\")*1)","v":{"$error":"#REF!"}},{"$f":"IF(ISBLANK(AnalysesComparatives!#REF!),\"\",SUBSTITUTE(AnalysesComparatives!#REF!,\"<\",\"\")*1)","v":{"$error":"#REF!"}},{"$f":"IF(OR(K45=\"\",J45=\"\"),\"\",IF(AND(J45<=SC_NO2,K45<=SC_NO2),\"-\",(J45-AVERAGE(J45:K45))/AVERAGE(J45:K45)))","v":{"$error":"#REF!"}},{"$f":"IF(L45=\"\",\"\",IF(L45=\"-\",\"oui\",IF(OR(AND(AVERAGE(J45:K45)>NO2faible,ABS(L45)>3*EMT_NO2_forte),AND(AVERAGE(J45:K45)<NO2faible,ABS(L45)>3*EMT_NO2_faible)),\"non\",IF(AND(J45<=SC_NO2,K45<=SC_NO2),\"oui\",IF(AND(AVERAGE(J45:K45)>NO2faible,L45>=-EMT_NO2_forte,L45<=EMT_NO2_forte),\"oui\",IF(AND(AVERAGE(J45:K45)<=NO2faible,L45>=-EMT_NO2_faible,L45<=EMT_NO2_faible),\"oui\",\"non\"))))))","v":{"$error":"#REF!"}}]
["NO3",{"$f":"IF(ISBLANK(AnalysesComparatives!#REF!),\"\",SUBSTITUTE(AnalysesComparatives!#REF!,\"<\",\"\")*1)","v":{"$error":"#REF!"}},{"$f":"IF(ISBLANK(AnalysesComparatives!#REF!),\"\",SUBSTITUTE(AnalysesComparatives!#REF!,\"<\",\"\")*1)","v":{"$error":"#REF!"}},{"$f":"IF(OR(C46=\"\",B46=\"\"),\"\",IF(AND(B46<=SC_NO3,C46<=SC_NO3),\"-\",(B46-AVERAGE(B46:C46))/AVERAGE(B46:C46)))","v":{"$error":"#REF!"}},{"$f":"IF(D46=\"\",\"\",IF(D46=\"-\",\"oui\",IF(OR(AND(AVERAGE(B46:C46)>NO3faible,ABS(D46)>3*EMT_NO3_forte),AND(AVERAGE(B46:C46)<NO3faible,ABS(D46)>3*EMT_NO3_faible)),\"non\",IF(AND(B46<=SC_NO3,C46<=SC_NO3),\"oui\",IF(AND(AVERAGE(B46:C46)>NO3faible,D46>=-EMT_NO3_forte,D46<=EMT_NO3_forte),\"oui\",IF(AND(AVERAGE(B46:C46)<=NO3faible,D46>=-EMT_NO3_faible,D46<=EMT_NO3_faible),\"oui\",\"non\"))))))","v":{"$error":"#REF!"}},{"$f":"IF(ISBLANK(AnalysesComparatives!#REF!),\"\",SUBSTITUTE(AnalysesComparatives!#REF!,\"<\",\"\")*1)","v":{"$error":"#REF!"}},{"$f":"IF(ISBLANK(AnalysesComparatives!#REF!),\"\",SUBSTITUTE(AnalysesComparatives!#REF!,\"<\",\"\")*1)","v":{"$error":"#REF!"}},{"$f":"IF(OR(G46=\"\",F46=\"\"),\"\",IF(AND(F46<=SC_NO3,G46<=SC_NO3),\"-\",(F46-AVERAGE(F46:G46))/AVERAGE(F46:G46)))","v":{"$error":"#REF!"}},{"$f":"IF(H46=\"\",\"\",IF(H46=\"-\",\"oui\",IF(OR(AND(AVERAGE(F46:G46)>NO3faible,ABS(H46)>3*EMT_NO3_forte),AND(AVERAGE(F46:G46)<NO3faible,ABS(H46)>3*EMT_NO3_faible)),\"non\",IF(AND(F46<=SC_NO3,G46<=SC_NO3),\"oui\",IF(AND(AVERAGE(F46:G46)>NO3faible,H46>=-EMT_NO3_forte,H46<=EMT_NO3_forte),\"oui\",IF(AND(AVERAGE(F46:G46)<=NO3faible,H46>=-EMT_NO3_faible,H46<=EMT_NO3_faible),\"oui\",\"non\"))))))","v":{"$error":"#REF!"}},{"$f":"IF(ISBLANK(AnalysesComparatives!#REF!),\"\",SUBSTITUTE(AnalysesComparatives!#REF!,\"<\",\"\")*1)","v":{"$error":"#REF!"}},{"$f":"IF(ISBLANK(AnalysesComparatives!#REF!),\"\",SUBSTITUTE(AnalysesComparatives!#REF!,\"<\",\"\")*1)","v":{"$error":"#REF!"}},{"$f":"IF(OR(K46=\"\",J46=\"\"),\"\",IF(AND(J46<=SC_NO3,K46<=SC_NO3),\"-\",(J46-AVERAGE(J46:K46))/AVERAGE(J46:K46)))","v":{"$error":"#REF!"}},{"$f":"IF(L46=\"\",\"\",IF(L46=\"-\",\"oui\",IF(OR(AND(AVERAGE(J46:K46)>NO3faible,ABS(L46)>3*EMT_NO3_forte),AND(AVERAGE(J46:K46)<NO3faible,ABS(L46)>3*EMT_NO3_faible)),\"non\",IF(AND(J46<=SC_NO3,K46<=SC_NO3),\"oui\",IF(AND(AVERAGE(J46:K46)>NO3faible,L46>=-EMT_NO3_forte,L46<=EMT_NO3_forte),\"oui\",IF(AND(AVERAGE(J46:K46)<=NO3faible,L46>=-EMT_NO3_faible,L46<=EMT_NO3_faible),\"oui\",\"non\"))))))","v":{"$error":"#REF!"}}]
["Azote Global",{"$f":"IF(ISBLANK(AnalysesComparatives!#REF!),\"\",SUBSTITUTE(AnalysesComparatives!#REF!,\"<\",\"\")*1)","v":{"$error":"#REF!"}},{"$f":"IF(ISBLANK(AnalysesComparatives!#REF!),\"\",SUBSTITUTE(AnalysesComparatives!#REF!,\"<\",\"\")*1)","v":{"$error":"#REF!"}},{"$f":"IF(OR(C47=\"\",B47=\"\"),\"\",IF(AND(B47<=SC_NG,C47<=SC_NG),\"-\",(B47-AVERAGE(B47:C47))/AVERAGE(B47:C47)))","v":{"$error":"#REF!"}},{"$f":"IF(D47=\"\",\"\",IF(D47=\"-\",\"oui\",IF(OR(AND(AVERAGE(B47:C47)>NGfaible,ABS(D47)>3*EMT_NG_forte),AND(AVERAGE(B47:C47)<NGfaible,ABS(D47)>3*EMT_NG_faible)),\"non\",IF(AND(B47<=SC_NG,C47<=SC_NG),\"oui\",IF(AND(AVERAGE(B47:C47)>NGfaible,D47>=-EMT_NG_forte,D47<=EMT_NG_forte),\"oui\",IF(AND(AVERAGE(B47:C47)<=NGfaible,D47>=-EMT_NG_faible,D47<=EMT_NG_faible),\"oui\",\"non\"))))))","v":{"$error":"#REF!"}},{"$f":"IF(ISBLANK(AnalysesComparatives!#REF!),\"\",SUBSTITUTE(AnalysesComparatives!#REF!,\"<\",\"\")*1)","v":{"$error":"#REF!"}},{"$f":"IF(ISBLANK(AnalysesComparatives!#REF!),\"\",SUBSTITUTE(AnalysesComparatives!#REF!,\"<\",\"\")*1)","v":{"$error":"#REF!"}},{"$f":"IF(OR(G47=\"\",F47=\"\"),\"\",IF(AND(F47<=SC_NG,G47<=SC_NG),\"-\",(F47-AVERAGE(F47:G47))/AVERAGE(F47:G47)))","v":{"$error":"#REF!"}},{"$f":"IF(H47=\"\",\"\",IF(H47=\"-\",\"oui\",IF(OR(AND(AVERAGE(F47:G47)>NGfaible,ABS(H47)>3*EMT_NG_forte),AND(AVERAGE(F47:G47)<NGfaible,ABS(H47)>3*EMT_NG_faible)),\"non\",IF(AND(F47<=SC_NG,G47<=SC_NG),\"oui\",IF(AND(AVERAGE(F47:G47)>NGfaible,H47>=-EMT_NG_forte,H47<=EMT_NG_forte),\"oui\",IF(AND(AVERAGE(F47:G47)<=NGfaible,H47>=-EMT_NG_faible,H47<=EMT_NG_faible),\"oui\",\"non\"))))))","v":{"$error":"#REF!"}},{"$f":"IF(ISBLANK(AnalysesComparatives!#REF!),\"\",SUBSTITUTE(AnalysesComparatives!#REF!,\"<\",\"\")*1)","v":{"$error":"#REF!"}},{"$f":"IF(ISBLANK(AnalysesComparatives!#REF!),\"\",SUBSTITUTE(AnalysesComparatives!#REF!,\"<\",\"\")*1)","v":{"$error":"#REF!"}},{"$f":"IF(OR(K47=\"\",J47=\"\"),\"\",IF(AND(J47<=SC_NG,K47<=SC_NG),\"-\",(J47-AVERAGE(J47:K47))/AVERAGE(J47:K47)))","v":{"$error":"#REF!"}},{"$f":"IF(L47=\"\",\"\",IF(L47=\"-\",\"oui\",IF(OR(AND(AVERAGE(J47:K47)>NGfaible,ABS(L47)>3*EMT_NG_forte),AND(AVERAGE(J47:K47)<NGfaible,ABS(L47)>3*EMT_NG_faible)),\"non\",IF(AND(J47<=SC_NG,K47<=SC_NG),\"oui\",IF(AND(AVERAGE(J47:K47)>NGfaible,L47>=-EMT_NG_forte,L47<=EMT_NG_forte),\"oui\",IF(AND(AVERAGE(J47:K47)<=NGfaible,L47>=-EMT_NG_faible,L47<=EMT_NG_faible),\"oui\",\"non\"))))))","v":{"$error":"#REF!"}}]
["PT",{"$f":"IF(ISBLANK(AnalysesComparatives!#REF!),\"\",SUBSTITUTE(AnalysesComparatives!#REF!,\"<\",\"\")*1)","v":{"$error":"#REF!"}},{"$f":"IF(ISBLANK(AnalysesComparatives!#REF!),\"\",SUBSTITUTE(AnalysesComparatives!#REF!,\"<\",\"\")*1)","v":{"$error":"#REF!"}},{"$f":"IF(OR(C48=\"\",B48=\"\"),\"\",IF(AND(B48<=SC_Pt,C48<=SC_Pt),\"-\",(B48-AVERAGE(B48:C48))/AVERAGE(B48:C48)))","v":{"$error":"#REF!"}},{"$f":"IF(D48=\"\",\"\",IF(D48=\"-\",\"oui\",IF(OR(AND(AVERAGE(B48:C48)>Ptfaible,ABS(D48)>3*EMT_Pt_forte),AND(AVERAGE(B48:C48)<Ptfaible,ABS(D48)>3*EMT_Pt_faible)),\"non\",IF(AND(B48<=SC_Pt,C48<=SC_Pt),\"oui\",IF(AND(AVERAGE(B48:C48)>Ptfaible,D48>=-EMT_Pt_forte,D48<=EMT_Pt_forte),\"oui\",IF(AND(AVERAGE(B48:C48)<=Ptfaible,D48>=-EMT_Pt_faible,D48<=EMT_Pt_faible),\"oui\",\"non\"))))))","v":{"$error":"#REF!"}},{"$f":"IF(ISBLANK(AnalysesComparatives!#REF!),\"\",SUBSTITUTE(AnalysesComparatives!#REF!,\"<\",\"\")*1)","v":{"$error":"#REF!"}},{"$f":"IF(ISBLANK(AnalysesComparatives!#REF!),\"\",SUBSTITUTE(AnalysesComparatives!#REF!,\"<\",\"\")*1)","v":{"$error":"#REF!"}},{"$f":"IF(OR(G48=\"\",F48=\"\"),\"\",IF(AND(F48<=SC_Pt,G48<=SC_Pt),\"-\",(F48-AVERAGE(F48:G48))/AVERAGE(F48:G48)))","v":{"$error":"#REF!"}},{"$f":"IF(H48=\"\",\"\",IF(H48=\"-\",\"oui\",IF(OR(AND(AVERAGE(F48:G48)>Ptfaible,ABS(H48)>3*EMT_Pt_forte),AND(AVERAGE(F48:G48)<Ptfaible,ABS(H48)>3*EMT_Pt_faible)),\"non\",IF(AND(F48<=SC_Pt,G48<=SC_Pt),\"oui\",IF(AND(AVERAGE(F48:G48)>Ptfaible,H48>=-EMT_Pt_forte,H48<=EMT_Pt_forte),\"oui\",IF(AND(AVERAGE(F48:G48)<=Ptfaible,H48>=-EMT_Pt_faible,H48<=EMT_Pt_faible),\"oui\",\"non\"))))))","v":{"$error":"#REF!"}},{"$f":"IF(ISBLANK(AnalysesComparatives!#REF!),\"\",SUBSTITUTE(AnalysesComparatives!#REF!,\"<\",\"\")*1)","v":{"$error":"#REF!"}},{"$f":"IF(ISBLANK(AnalysesComparatives!#REF!),\"\",SUBSTITUTE(AnalysesComparatives!#REF!,\"<\",\"\")*1)","v":{"$error":"#REF!"}},{"$f":"IF(OR(K48=\"\",J48=\"\"),\"\",IF(AND(J48<=SC_Pt,K48<=SC_Pt),\"-\",(J48-AVERAGE(J48:K48))/AVERAGE(J48:K48)))","v":{"$error":"#REF!"}},{"$f":"IF(L48=\"\",\"\",IF(L48=\"-\",\"oui\",IF(OR(AND(AVERAGE(J48:K48)>Ptfaible,ABS(L48)>3*EMT_Pt_forte),AND(AVERAGE(J48:K48)<Ptfaible,ABS(L48)>3*EMT_Pt_faible)),\"non\",IF(AND(J48<=SC_Pt,K48<=SC_Pt),\"oui\",IF(AND(AVERAGE(J48:K48)>Ptfaible,L48>=-EMT_Pt_forte,L48<=EMT_Pt_forte),\"oui\",IF(AND(AVERAGE(J48:K48)<=Ptfaible,L48>=-EMT_Pt_faible,L48<=EMT_Pt_faible),\"oui\",\"non\"))))))","v":{"$error":"#REF!"}}]
["ST_DCO",{"$f":"IF(ISBLANK(AnalysesComparatives!#REF!),\"\",SUBSTITUTE(AnalysesComparatives!#REF!,\"<\",\"\")*1)","v":{"$error":"#REF!"}},{"$f":"IF(ISBLANK(AnalysesComparatives!#REF!),\"\",SUBSTITUTE(AnalysesComparatives!#REF!,\"<\",\"\")*1)","v":{"$error":"#REF!"}},{"$f":"IF(OR(C49=\"\",B49=\"\"),\"\",IF(AND(B49<=SC_ST_DCO,C49<=SC_ST_DCO),\"-\",(B49-AVERAGE(B49:C49))/AVERAGE(B49:C49)))","v":{"$error":"#REF!"}},{"$f":"IF(D49=\"\",\"\",IF(D49=\"-\",\"oui\",IF(OR(AND(AVERAGE(B49:C49)>ST_DCOfaible,ABS(D49)>3*EMT_ST_DCO_forte),AND(AVERAGE(B49:C49)<ST_DCOfaible,ABS(D49)>3*EMT_ST_DCO_faible)),\"non\",IF(AND(B49<=SC_ST_DCO,C49<=SC_ST_DCO),\"oui\",IF(AND(AVERAGE(B49:C49)>ST_DCOfaible,D49>=-EMT_ST_DCO_forte,D49<=EMT_ST_DCO_forte),\"oui\",IF(AND(AVERAGE(B49:C49)<=ST_DCOfaible,D49>=-EMT_ST_DCO_faible,D49<=EMT_ST_DCO_faible),\"oui\",\"non\"))))))","v":{"$error":"#REF!"}},{"$f":"IF(ISBLANK(AnalysesComparatives!#REF!),\"\",SUBSTITUTE(AnalysesComparatives!#REF!,\"<\",\"\")*1)","v":{"$error":"#REF!"}},{"$f":"IF(ISBLANK(AnalysesComparatives!#REF!),\"\",SUBSTITUTE(AnalysesComparatives!#REF!,\"<\",\"\")*1)","v":{"$error":"#REF!"}},{"$f":"IF(OR(G49=\"\",F49=\"\"),\"\",IF(AND(F49<=SC_ST_DCO,G49<=SC_ST_DCO),\"-\",(F49-AVERAGE(F49:G49))/AVERAGE(F49:G49)))","v":{"$error":"#REF!"}},{"$f":"IF(H49=\"\",\"\",IF(H49=\"-\",\"oui\",IF(OR(AND(AVERAGE(F49:G49)>ST_DCOfaible,ABS(H49)>3*EMT_ST_DCO_forte),AND(AVERAGE(F49:G49)<ST_DCOfaible,ABS(H49)>3*EMT_ST_DCO_faible)),\"non\",IF(AND(F49<=SC_ST_DCO,G49<=SC_ST_DCO),\"oui\",IF(AND(AVERAGE(F49:G49)>ST_DCOfaible,H49>=-EMT_ST_DCO_forte,H49<=EMT_ST_DCO_forte),\"oui\",IF(AND(AVERAGE(F49:G49)<=ST_DCOfaible,H49>=-EMT_ST_DCO_faible,H49<=EMT_ST_DCO_faible),\"oui\",\"non\"))))))","v":{"$error":"#REF!"}},{"$f":"IF(ISBLANK(AnalysesComparatives!#REF!),\"\",SUBSTITUTE(AnalysesComparatives!#REF!,\"<\",\"\")*1)","v":{"$error":"#REF!"}},{"$f":"IF(ISBLANK(AnalysesComparatives!#REF!),\"\",SUBSTITUTE(AnalysesComparatives!#REF!,\"<\",\"\")*1)","v":{"$error":"#REF!"}},{"$f":"IF(OR(K49=\"\",J49=\"\"),\"\",IF(AND(J49<=SC_ST_DCO,K49<=SC_ST_DCO),\"-\",(J49-AVERAGE(J49:K49))/AVERAGE(J49:K49)))","v":{"$error":"#REF!"}},{"$f":"IF(L49=\"\",\"\",IF(L49=\"-\",\"oui\",IF(OR(AND(AVERAGE(J49:K49)>ST_DCOfaible,ABS(L49)>3*EMT_ST_DCO_forte),AND(AVERAGE(J49:K49)<ST_DCOfaible,ABS(L49)>3*EMT_ST_DCO_faible)),\"non\",IF(AND(J49<=SC_ST_DCO,K49<=SC_ST_DCO),\"oui\",IF(AND(AVERAGE(J49:K49)>ST_DCOfaible,L49>=-EMT_ST_DCO_forte,L49<=EMT_ST_DCO_forte),\"oui\",IF(AND(AVERAGE(J49:K49)<=ST_DCOfaible,L49>=-EMT_ST_DCO_faible,L49<=EMT_ST_DCO_faible),\"oui\",\"non\"))))))","v":{"$error":"#REF!"}}]
["As",{"$f":"IF(ISBLANK(AnalysesComparatives!#REF!),\"\",SUBSTITUTE(AnalysesComparatives!#REF!,\"<\",\"\")*1)","v":{"$error":"#REF!"}},{"$f":"IF(ISBLANK(AnalysesComparatives!#REF!),\"\",SUBSTITUTE(AnalysesComparatives!#REF!,\"<\",\"\")*1)","v":{"$error":"#REF!"}},{"$f":"IF(OR(C50=\"\",B50=\"\"),\"\",IF(AND(B50<=SC_Metaux,C50<=SC_Metaux),\"-\",(B50-AVERAGE(B50:C50))/AVERAGE(B50:C50)))","v":{"$error":"#REF!"}},{"$f":"IF(D50=\"\",\"\",IF(D50=\"-\",\"oui\",IF(OR(AND(AVERAGE(B50:C50)>Metauxfaible,ABS(D50)>3*EMT_Metaux_forte),AND(AVERAGE(B50:C50)<Metauxfaible,ABS(D50)>3*EMT_Metaux_faible)),\"non\",IF(AND(B50<=SC_Metaux,C50<=SC_Metaux),\"oui\",IF(AND(AVERAGE(B50:C50)>Metauxfaible,D50>=-EMT_Metaux_forte,D50<=EMT_Metaux_forte),\"oui\",IF(AND(AVERAGE(B50:C50)<=Metauxfaible,D50>=-EMT_Metaux_faible,D50<=EMT_Metaux_faible),\"oui\",\"non\"))))))","v":{"$error":"#REF!"}},{"$f":"IF(ISBLANK(AnalysesComparatives!#REF!),\"\",SUBSTITUTE(AnalysesComparatives!#REF!,\"<\",\"\")*1)","v":{"$error":"#REF!"}},{"$f":"IF(ISBLANK(AnalysesComparatives!#REF!),\"\",SUBSTITUTE(AnalysesComparatives!#REF!,\"<\",\"\")*1)","v":{"$error":"#REF!"}},{"$f":"IF(OR(G50=\"\",F50=\"\"),\"\",IF(AND(F50<=SC_Metaux,G50<=SC_Metaux),\"-\",(F50-AVERAGE(F50:G50))/AVERAGE(F50:G50)))","v":{"$error":"#REF!"}},{"$f":"IF(H50=\"\",\"\",IF(H50=\"-\",\"oui\",IF(OR(AND(AVERAGE(F50:G50)>Metauxfaible,ABS(H50)>3*EMT_Metaux_forte),AND(AVERAGE(F50:G50)<Metauxfaible,ABS(H50)>3*EMT_Metaux_faible)),\"non\",IF(AND(F50<=SC_Metaux,G50<=SC_Metaux),\"oui\",IF(AND(AVERAGE(F50:G50)>Metauxfaible,H50>=-EMT_Metaux_forte,H50<=EMT_Metaux_forte),\"oui\",IF(AND(AVERAGE(F50:G50)<=Metauxfaible,H50>=-EMT_Metaux_faible,H50<=EMT_Metaux_faible),\"oui\",\"non\"))))))","v":{"$error":"#REF!"}},{"$f":"IF(ISBLANK(AnalysesComparatives!#REF!),\"\",SUBSTITUTE(AnalysesComparatives!#REF!,\"<\",\"\")*1)","v":{"$error":"#REF!"}},{"$f":"IF(ISBLANK(AnalysesComparatives!#REF!),\"\",SUBSTITUTE(AnalysesComparatives!#REF!,\"<\",\"\")*1)","v":{"$error":"#REF!"}},{"$f":"IF(OR(K50=\"\",J50=\"\"),\"\",IF(AND(J50<=SC_Metaux,K50<=SC_Metaux),\"-\",(J50-AVERAGE(J50:K50))/AVERAGE(J50:K50)))","v":{"$error":"#REF!"}},{"$f":"IF(L50=\"\",\"\",IF(L50=\"-\",\"oui\",IF(OR(AND(AVERAGE(J50:K50)>Metauxfaible,ABS(L50)>3*EMT_Metaux_forte),AND(AVERAGE(J50:K50)<Metauxfaible,ABS(L50)>3*EMT_Metaux_faible)),\"non\",IF(AND(J50<=SC_Metaux,K50<=SC_Metaux),\"oui\",IF(AND(AVERAGE(J50:K50)>Metauxfaible,L50>=-EMT_Metaux_forte,L50<=EMT_Metaux_forte),\"oui\",IF(AND(AVERAGE(J50:K50)<=Metauxfaible,L50>=-EMT_Metaux_faible,L50<=EMT_Metaux_faible),\"oui\",\"non\"))))))","v":{"$error":"#REF!"}}]
["Cd",{"$f":"IF(ISBLANK(AnalysesComparatives!#REF!),\"\",SUBSTITUTE(AnalysesComparatives!#REF!,\"<\",\"\")*1)","v":{"$error":"#REF!"}},{"$f":"IF(ISBLANK(AnalysesComparatives!#REF!),\"\",SUBSTITUTE(AnalysesComparatives!#REF!,\"<\",\"\")*1)","v":{"$error":"#REF!"}},{"$error":"#REF!"},{"$f":"IF(D51=\"\",\"\",IF(D51=\"-\",\"oui\",IF(OR(AND(AVERAGE(B51:C51)>Metauxfaible,ABS(D51)>3*EMT_Metaux_forte),AND(AVERAGE(B51:C51)<Metauxfaible,ABS(D51)>3*EMT_Metaux_faible)),\"non\",IF(AND(B51<=SC_Metaux,C51<=SC_Metaux),\"oui\",IF(AND(AVERAGE(B51:C51)>Metauxfaible,D51>=-EMT_Metaux_forte,D51<=EMT_Metaux_forte),\"oui\",IF(AND(AVERAGE(B51:C51)<=Metauxfaible,D51>=-EMT_Metaux_faible,D51<=EMT_Metaux_faible),\"oui\",\"non\"))))))","v":{"$error":"#REF!"}},{"$f":"IF(ISBLANK(AnalysesComparatives!#REF!),\"\",SUBSTITUTE(AnalysesComparatives!#REF!,\"<\",\"\")*1)","v":{"$error":"#REF!"}},{"$f":"IF(ISBLANK(AnalysesComparatives!#REF!),\"\",SUBSTITUTE(AnalysesComparatives!#REF!,\"<\",\"\")*1)","v":{"$error":"#REF!"}},{"$error":"#REF!"},{"$f":"IF(H51=\"\",\"\",IF(H51=\"-\",\"oui\",IF(OR(AND(AVERAGE(F51:G51)>Metauxfaible,ABS(H51)>3*EMT_Metaux_forte),AND(AVERAGE(F51:G51)<Metauxfaible,ABS(H51)>3*EMT_Metaux_faible)),\"non\",IF(AND(F51<=SC_Metaux,G51<=SC_Metaux),\"oui\",IF(AND(AVERAGE(F51:G51)>Metauxfaible,H51>=-EMT_Metaux_forte,H51<=EMT_Metaux_forte),\"oui\",IF(AND(AVERAGE(F51:G51)<=Metauxfaible,H51>=-EMT_Metaux_faible,H51<=EMT_Metaux_faible),\"oui\",\"non\"))))))","v":{"$error":"#REF!"}},{"$f":"IF(ISBLANK(AnalysesComparatives!#REF!),\"\",SUBSTITUTE(AnalysesComparatives!#REF!,\"<\",\"\")*1)","v":{"$error":"#REF!"}},{"$f":"IF(ISBLANK(AnalysesComparatives!#REF!),\"\",SUBSTITUTE(AnalysesComparatives!#REF!,\"<\",\"\")*1)","v":{"$error":"#REF!"}},{"$error":"#REF!"},{"$f":"IF(L51=\"\",\"\",IF(L51=\"-\",\"oui\",IF(OR(AND(AVERAGE(J51:K51)>Metauxfaible,ABS(L51)>3*EMT_Metaux_forte),AND(AVERAGE(J51:K51)<Metauxfaible,ABS(L51)>3*EMT_Metaux_faible)),\"non\",IF(AND(J51<=SC_Metaux,K51<=SC_Metaux),\"oui\",IF(AND(AVERAGE(J51:K51)>Metauxfaible,L51>=-EMT_Metaux_forte,L51<=EMT_Metaux_forte),\"oui\",IF(AND(AVERAGE(J51:K51)<=Metauxfaible,L51>=-EMT_Metaux_faible,L51<=EMT_Metaux_faible),\"oui\",\"non\"))))))","v":{"$error":"#REF!"}}]
["Cr",{"$f":"IF(ISBLANK(AnalysesComparatives!#REF!),\"\",SUBSTITUTE(AnalysesComparatives!#REF!,\"<\",\"\")*1)","v":{"$error":"#REF!"}},{"$f":"IF(ISBLANK(AnalysesComparatives!#REF!),\"\",SUBSTITUTE(AnalysesComparatives!#REF!,\"<\",\"\")*1)","v":{"$error":"#REF!"}},{"$error":"#REF!"},{"$f":"IF(D52=\"\",\"\",IF(D52=\"-\",\"oui\",IF(OR(AND(AVERAGE(B52:C52)>Metauxfaible,ABS(D52)>3*EMT_Metaux_forte),AND(AVERAGE(B52:C52)<Metauxfaible,ABS(D52)>3*EMT_Metaux_faible)),\"non\",IF(AND(B52<=SC_Metaux,C52<=SC_Metaux),\"oui\",IF(AND(AVERAGE(B52:C52)>Metauxfaible,D52>=-EMT_Metaux_forte,D52<=EMT_Metaux_forte),\"oui\",IF(AND(AVERAGE(B52:C52)<=Metauxfaible,D52>=-EMT_Metaux_faible,D52<=EMT_Metaux_faible),\"oui\",\"non\"))))))","v":{"$error":"#REF!"}},{"$f":"IF(ISBLANK(AnalysesComparatives!#REF!),\"\",SUBSTITUTE(AnalysesComparatives!#REF!,\"<\",\"\")*1)","v":{"$error":"#REF!"}},{"$f":"IF(ISBLANK(AnalysesComparatives!#REF!),\"\",SUBSTITUTE(AnalysesComparatives!#REF!,\"<\",\"\")*1)","v":{"$error":"#REF!"}},{"$error":"#REF!"},{"$f":"IF(H52=\"\",\"\",IF(H52=\"-\",\"oui\",IF(OR(AND(AVERAGE(F52:G52)>Metauxfaible,ABS(H52)>3*EMT_Metaux_forte),AND(AVERAGE(F52:G52)<Metauxfaible,ABS(H52)>3*EMT_Metaux_faible)),\"non\",IF(AND(F52<=SC_Metaux,G52<=SC_Metaux),\"oui\",IF(AND(AVERAGE(F52:G52)>Metauxfaible,H52>=-EMT_Metaux_forte,H52<=EMT_Metaux_forte),\"oui\",IF(AND(AVERAGE(F52:G52)<=Metauxfaible,H52>=-EMT_Metaux_faible,H52<=EMT_Metaux_faible),\"oui\",\"non\"))))))","v":{"$error":"#REF!"}},{"$f":"IF(ISBLANK(AnalysesComparatives!#REF!),\"\",SUBSTITUTE(AnalysesComparatives!#REF!,\"<\",\"\")*1)","v":{"$error":"#REF!"}},{"$f":"IF(ISBLANK(AnalysesComparatives!#REF!),\"\",SUBSTITUTE(AnalysesComparatives!#REF!,\"<\",\"\")*1)","v":{"$error":"#REF!"}},{"$error":"#REF!"},{"$f":"IF(L52=\"\",\"\",IF(L52=\"-\",\"oui\",IF(OR(AND(AVERAGE(J52:K52)>Metauxfaible,ABS(L52)>3*EMT_Metaux_forte),AND(AVERAGE(J52:K52)<Metauxfaible,ABS(L52)>3*EMT_Metaux_faible)),\"non\",IF(AND(J52<=SC_Metaux,K52<=SC_Metaux),\"oui\",IF(AND(AVERAGE(J52:K52)>Metauxfaible,L52>=-EMT_Metaux_forte,L52<=EMT_Metaux_forte),\"oui\",IF(AND(AVERAGE(J52:K52)<=Metauxfaible,L52>=-EMT_Metaux_faible,L52<=EMT_Metaux_faible),\"oui\",\"non\"))))))","v":{"$error":"#REF!"}}]
["Cu",{"$f":"IF(ISBLANK(AnalysesComparatives!#REF!),\"\",SUBSTITUTE(AnalysesComparatives!#REF!,\"<\",\"\")*1)","v":{"$error":"#REF!"}},{"$f":"IF(ISBLANK(AnalysesComparatives!#REF!),\"\",SUBSTITUTE(AnalysesComparatives!#REF!,\"<\",\"\")*1)","v":{"$error":"#REF!"}},{"$error":"#REF!"},{"$f":"IF(D53=\"\",\"\",IF(D53=\"-\",\"oui\",IF(OR(AND(AVERAGE(B53:C53)>Metauxfaible,ABS(D53)>3*EMT_Metaux_forte),AND(AVERAGE(B53:C53)<Metauxfaible,ABS(D53)>3*EMT_Metaux_faible)),\"non\",IF(AND(B53<=SC_Metaux,C53<=SC_Metaux),\"oui\",IF(AND(AVERAGE(B53:C53)>Metauxfaible,D53>=-EMT_Metaux_forte,D53<=EMT_Metaux_forte),\"oui\",IF(AND(AVERAGE(B53:C53)<=Metauxfaible,D53>=-EMT_Metaux_faible,D53<=EMT_Metaux_faible),\"oui\",\"non\"))))))","v":{"$error":"#REF!"}},{"$f":"IF(ISBLANK(AnalysesComparatives!#REF!),\"\",SUBSTITUTE(AnalysesComparatives!#REF!,\"<\",\"\")*1)","v":{"$error":"#REF!"}},{"$f":"IF(ISBLANK(AnalysesComparatives!#REF!),\"\",SUBSTITUTE(AnalysesComparatives!#REF!,\"<\",\"\")*1)","v":{"$error":"#REF!"}},{"$error":"#REF!"},{"$f":"IF(H53=\"\",\"\",IF(H53=\"-\",\"oui\",IF(OR(AND(AVERAGE(F53:G53)>Metauxfaible,ABS(H53)>3*EMT_Metaux_forte),AND(AVERAGE(F53:G53)<Metauxfaible,ABS(H53)>3*EMT_Metaux_faible)),\"non\",IF(AND(F53<=SC_Metaux,G53<=SC_Metaux),\"oui\",IF(AND(AVERAGE(F53:G53)>Metauxfaible,H53>=-EMT_Metaux_forte,H53<=EMT_Metaux_forte),\"oui\",IF(AND(AVERAGE(F53:G53)<=Metauxfaible,H53>=-EMT_Metaux_faible,H53<=EMT_Metaux_faible),\"oui\",\"non\"))))))","v":{"$error":"#REF!"}},{"$f":"IF(ISBLANK(AnalysesComparatives!#REF!),\"\",SUBSTITUTE(AnalysesComparatives!#REF!,\"<\",\"\")*1)","v":{"$error":"#REF!"}},{"$f":"IF(ISBLANK(AnalysesComparatives!#REF!),\"\",SUBSTITUTE(AnalysesComparatives!#REF!,\"<\",\"\")*1)","v":{"$error":"#REF!"}},{"$error":"#REF!"},{"$f":"IF(L53=\"\",\"\",IF(L53=\"-\",\"oui\",IF(OR(AND(AVERAGE(J53:K53)>Metauxfaible,ABS(L53)>3*EMT_Metaux_forte),AND(AVERAGE(J53:K53)<Metauxfaible,ABS(L53)>3*EMT_Metaux_faible)),\"non\",IF(AND(J53<=SC_Metaux,K53<=SC_Metaux),\"oui\",IF(AND(AVERAGE(J53:K53)>Metauxfaible,L53>=-EMT_Metaux_forte,L53<=EMT_Metaux_forte),\"oui\",IF(AND(AVERAGE(J53:K53)<=Metauxfaible,L53>=-EMT_Metaux_faible,L53<=EMT_Metaux_faible),\"oui\",\"non\"))))))","v":{"$error":"#REF!"}}]
["Hg",{"$f":"IF(ISBLANK(AnalysesComparatives!#REF!),\"\",SUBSTITUTE(AnalysesComparatives!#REF!,\"<\",\"\")*1)","v":{"$error":"#REF!"}},{"$f":"IF(ISBLANK(AnalysesComparatives!#REF!),\"\",SUBSTITUTE(AnalysesComparatives!#REF!,\"<\",\"\")*1)","v":{"$error":"#REF!"}},{"$error":"#REF!"},{"$f":"IF(D54=\"\",\"\",IF(D54=\"-\",\"oui\",IF(OR(AND(AVERAGE(B54:C54)>Hgfaible,ABS(D54)>3*EMT_Hg_forte),AND(AVERAGE(B54:C54)<Hgfaible,ABS(D54)>3*EMT_Hg_faible)),\"non\",IF(AND(B54<=SC_Hg,C54<=SC_Hg),\"oui\",IF(AND(AVERAGE(B54:C54)>Hgfaible,D54>=-EMT_Hg_forte,D54<=EMT_Hg_forte),\"oui\",IF(AND(AVERAGE(B54:C54)<=Hgfaible,D54>=-EMT_Hg_faible,D54<=EMT_Hg_faible),\"oui\",\"non\"))))))","v":{"$error":"#REF!"}},{"$f":"IF(ISBLANK(AnalysesComparatives!#REF!),\"\",SUBSTITUTE(AnalysesComparatives!#REF!,\"<\",\"\")*1)","v":{"$error":"#REF!"}},{"$f":"IF(ISBLANK(AnalysesComparatives!#REF!),\"\",SUBSTITUTE(AnalysesComparatives!#REF!,\"<\",\"\")*1)","v":{"$error":"#REF!"}},{"$error":"#REF!"},{"$f":"IF(H54=\"\",\"\",IF(H54=\"-\",\"oui\",IF(OR(AND(AVERAGE(F54:G54)>Hgfaible,ABS(H54)>3*EMT_Hg_forte),AND(AVERAGE(F54:G54)<Hgfaible,ABS(H54)>3*EMT_Hg_faible)),\"non\",IF(AND(F54<=SC_Hg,G54<=SC_Hg),\"oui\",IF(AND(AVERAGE(F54:G54)>Hgfaible,H54>=-EMT_Hg_forte,H54<=EMT_Hg_forte),\"oui\",IF(AND(AVERAGE(F54:G54)<=Hgfaible,H54>=-EMT_Hg_faible,H54<=EMT_Hg_faible),\"oui\",\"non\"))))))","v":{"$error":"#REF!"}},{"$f":"IF(ISBLANK(AnalysesComparatives!#REF!),\"\",SUBSTITUTE(AnalysesComparatives!#REF!,\"<\",\"\")*1)","v":{"$error":"#REF!"}},{"$f":"IF(ISBLANK(AnalysesComparatives!#REF!),\"\",SUBSTITUTE(AnalysesComparatives!#REF!,\"<\",\"\")*1)","v":{"$error":"#REF!"}},{"$error":"#REF!"},{"$f":"IF(L54=\"\",\"\",IF(L54=\"-\",\"oui\",IF(OR(AND(AVERAGE(J54:K54)>Hgfaible,ABS(L54)>3*EMT_Hg_forte),AND(AVERAGE(J54:K54)<Hgfaible,ABS(L54)>3*EMT_Hg_faible)),\"non\",IF(AND(J54<=SC_Hg,K54<=SC_Hg),\"oui\",IF(AND(AVERAGE(J54:K54)>Hgfaible,L54>=-EMT_Hg_forte,L54<=EMT_Hg_forte),\"oui\",IF(AND(AVERAGE(J54:K54)<=Hgfaible,L54>=-EMT_Hg_faible,L54<=EMT_Hg_faible),\"oui\",\"non\"))))))","v":{"$error":"#REF!"}}]
["Ni",{"$f":"IF(ISBLANK(AnalysesComparatives!#REF!),\"\",SUBSTITUTE(AnalysesComparatives!#REF!,\"<\",\"\")*1)","v":{"$error":"#REF!"}},{"$f":"IF(ISBLANK(AnalysesComparatives!#REF!),\"\",SUBSTITUTE(AnalysesComparatives!#REF!,\"<\",\"\")*1)","v":{"$error":"#REF!"}},{"$error":"#REF!"},{"$f":"IF(D55=\"\",\"\",IF(D55=\"-\",\"oui\",IF(OR(AND(AVERAGE(B55:C55)>Metauxfaible,ABS(D55)>3*EMT_Metaux_forte),AND(AVERAGE(B55:C55)<Metauxfaible,ABS(D55)>3*EMT_Metaux_faible)),\"non\",IF(AND(B55<=SC_Metaux,C55<=SC_Metaux),\"oui\",IF(AND(AVERAGE(B55:C55)>Metauxfaible,D55>=-EMT_Metaux_forte,D55<=EMT_Metaux_forte),\"oui\",IF(AND(AVERAGE(B55:C55)<=Metauxfaible,D55>=-EMT_Metaux_faible,D55<=EMT_Metaux_faible),\"oui\",\"non\"))))))","v":{"$error":"#REF!"}},{"$f":"IF(ISBLANK(AnalysesComparatives!#REF!),\"\",SUBSTITUTE(AnalysesComparatives!#REF!,\"<\",\"\")*1)","v":{"$error":"#REF!"}},{"$f":"IF(ISBLANK(AnalysesComparatives!#REF!),\"\",SUBSTITUTE(AnalysesComparatives!#REF!,\"<\",\"\")*1)","v":{"$error":"#REF!"}},{"$error":"#REF!"},{"$f":"IF(H55=\"\",\"\",IF(H55=\"-\",\"oui\",IF(OR(AND(AVERAGE(F55:G55)>Metauxfaible,ABS(H55)>3*EMT_Metaux_forte),AND(AVERAGE(F55:G55)<Metauxfaible,ABS(H55)>3*EMT_Metaux_faible)),\"non\",IF(AND(F55<=SC_Metaux,G55<=SC_Metaux),\"oui\",IF(AND(AVERAGE(F55:G55)>Metauxfaible,H55>=-EMT_Metaux_forte,H55<=EMT_Metaux_forte),\"oui\",IF(AND(AVERAGE(F55:G55)<=Metauxfaible,H55>=-EMT_Metaux_faible,H55<=EMT_Metaux_faible),\"oui\",\"non\"))))))","v":{"$error":"#REF!"}},{"$f":"IF(ISBLANK(AnalysesComparatives!#REF!),\"\",SUBSTITUTE(AnalysesComparatives!#REF!,\"<\",\"\")*1)","v":{"$error":"#REF!"}},{"$f":"IF(ISBLANK(AnalysesComparatives!#REF!),\"\",SUBSTITUTE(AnalysesComparatives!#REF!,\"<\",\"\")*1)","v":{"$error":"#REF!"}},{"$error":"#REF!"},{"$f":"IF(L55=\"\",\"\",IF(L55=\"-\",\"oui\",IF(OR(AND(AVERAGE(J55:K55)>Metauxfaible,ABS(L55)>3*EMT_Metaux_forte),AND(AVERAGE(J55:K55)<Metauxfaible,ABS(L55)>3*EMT_Metaux_faible)),\"non\",IF(AND(J55<=SC_Metaux,K55<=SC_Metaux),\"oui\",IF(AND(AVERAGE(J55:K55)>Metauxfaible,L55>=-EMT_Metaux_forte,L55<=EMT_Metaux_forte),\"oui\",IF(AND(AVERAGE(J55:K55)<=Metauxfaible,L55>=-EMT_Metaux_faible,L55<=EMT_Metaux_faible),\"oui\",\"non\"))))))","v":{"$error":"#REF!"}}]
["Pb",{"$f":"IF(ISBLANK(AnalysesComparatives!#REF!),\"\",SUBSTITUTE(AnalysesComparatives!#REF!,\"<\",\"\")*1)","v":{"$error":"#REF!"}},{"$f":"IF(ISBLANK(AnalysesComparatives!#REF!),\"\",SUBSTITUTE(AnalysesComparatives!#REF!,\"<\",\"\")*1)","v":{"$error":"#REF!"}},{"$error":"#REF!"},{"$f":"IF(D56=\"\",\"\",IF(D56=\"-\",\"oui\",IF(OR(AND(AVERAGE(B56:C56)>Metauxfaible,ABS(D56)>3*EMT_Metaux_forte),AND(AVERAGE(B56:C56)<Metauxfaible,ABS(D56)>3*EMT_Metaux_faible)),\"non\",IF(AND(B56<=SC_Metaux,C56<=SC_Metaux),\"oui\",IF(AND(AVERAGE(B56:C56)>Metauxfaible,D56>=-EMT_Metaux_forte,D56<=EMT_Metaux_forte),\"oui\",IF(AND(AVERAGE(B56:C56)<=Metauxfaible,D56>=-EMT_Metaux_faible,D56<=EMT_Metaux_faible),\"oui\",\"non\"))))))","v":{"$error":"#REF!"}},{"$f":"IF(ISBLANK(AnalysesComparatives!#REF!),\"\",SUBSTITUTE(AnalysesComparatives!#REF!,\"<\",\"\")*1)","v":{"$error":"#REF!"}},{"$f":"IF(ISBLANK(AnalysesComparatives!#REF!),\"\",SUBSTITUTE(AnalysesComparatives!#REF!,\"<\",\"\")*1)","v":{"$error":"#REF!"}},{"$error":"#REF!"},{"$f":"IF(H56=\"\",\"\",IF(H56=\"-\",\"oui\",IF(OR(AND(AVERAGE(F56:G56)>Metauxfaible,ABS(H56)>3*EMT_Metaux_forte),AND(AVERAGE(F56:G56)<Metauxfaible,ABS(H56)>3*EMT_Metaux_faible)),\"non\",IF(AND(F56<=SC_Metaux,G56<=SC_Metaux),\"oui\",IF(AND(AVERAGE(F56:G56)>Metauxfaible,H56>=-EMT_Metaux_forte,H56<=EMT_Metaux_forte),\"oui\",IF(AND(AVERAGE(F56:G56)<=Metauxfaible,H56>=-EMT_Metaux_faible,H56<=EMT_Metaux_faible),\"oui\",\"non\"))))))","v":{"$error":"#REF!"}},{"$f":"IF(ISBLANK(AnalysesComparatives!#REF!),\"\",SUBSTITUTE(AnalysesComparatives!#REF!,\"<\",\"\")*1)","v":{"$error":"#REF!"}},{"$f":"IF(ISBLANK(AnalysesComparatives!#REF!),\"\",SUBSTITUTE(AnalysesComparatives!#REF!,\"<\",\"\")*1)","v":{"$error":"#REF!"}},{"$error":"#REF!"},{"$f":"IF(L56=\"\",\"\",IF(L56=\"-\",\"oui\",IF(OR(AND(AVERAGE(J56:K56)>Metauxfaible,ABS(L56)>3*EMT_Metaux_forte),AND(AVERAGE(J56:K56)<Metauxfaible,ABS(L56)>3*EMT_Metaux_faible)),\"non\",IF(AND(J56<=SC_Metaux,K56<=SC_Metaux),\"oui\",IF(AND(AVERAGE(J56:K56)>Metauxfaible,L56>=-EMT_Metaux_forte,L56<=EMT_Metaux_forte),\"oui\",IF(AND(AVERAGE(J56:K56)<=Metauxfaible,L56>=-EMT_Metaux_faible,L56<=EMT_Metaux_faible),\"oui\",\"non\"))))))","v":{"$error":"#REF!"}}]
["Zn",{"$f":"IF(ISBLANK(AnalysesComparatives!#REF!),\"\",SUBSTITUTE(AnalysesComparatives!#REF!,\"<\",\"\")*1)","v":{"$error":"#REF!"}},{"$f":"IF(ISBLANK(AnalysesComparatives!#REF!),\"\",SUBSTITUTE(AnalysesComparatives!#REF!,\"<\",\"\")*1)","v":{"$error":"#REF!"}},{"$error":"#REF!"},{"$f":"IF(D57=\"\",\"\",IF(D57=\"-\",\"oui\",IF(OR(AND(AVERAGE(B57:C57)>Metauxfaible,ABS(D57)>3*EMT_Metaux_forte),AND(AVERAGE(B57:C57)<Metauxfaible,ABS(D57)>3*EMT_Metaux_faible)),\"non\",IF(AND(B57<=SC_Metaux,C57<=SC_Metaux),\"oui\",IF(AND(AVERAGE(B57:C57)>Metauxfaible,D57>=-EMT_Metaux_forte,D57<=EMT_Metaux_forte),\"oui\",IF(AND(AVERAGE(B57:C57)<=Metauxfaible,D57>=-EMT_Metaux_faible,D57<=EMT_Metaux_faible),\"oui\",\"non\"))))))","v":{"$error":"#REF!"}},{"$f":"IF(ISBLANK(AnalysesComparatives!#REF!),\"\",SUBSTITUTE(AnalysesComparatives!#REF!,\"<\",\"\")*1)","v":{"$error":"#REF!"}},{"$f":"IF(ISBLANK(AnalysesComparatives!#REF!),\"\",SUBSTITUTE(AnalysesComparatives!#REF!,\"<\",\"\")*1)","v":{"$error":"#REF!"}},{"$error":"#REF!"},{"$f":"IF(H57=\"\",\"\",IF(H57=\"-\",\"oui\",IF(OR(AND(AVERAGE(F57:G57)>Metauxfaible,ABS(H57)>3*EMT_Metaux_forte),AND(AVERAGE(F57:G57)<Metauxfaible,ABS(H57)>3*EMT_Metaux_faible)),\"non\",IF(AND(F57<=SC_Metaux,G57<=SC_Metaux),\"oui\",IF(AND(AVERAGE(F57:G57)>Metauxfaible,H57>=-EMT_Metaux_forte,H57<=EMT_Metaux_forte),\"oui\",IF(AND(AVERAGE(F57:G57)<=Metauxfaible,H57>=-EMT_Metaux_faible,H57<=EMT_Metaux_faible),\"oui\",\"non\"))))))","v":{"$error":"#REF!"}},{"$f":"IF(ISBLANK(AnalysesComparatives!#REF!),\"\",SUBSTITUTE(AnalysesComparatives!#REF!,\"<\",\"\")*1)","v":{"$error":"#REF!"}},{"$f":"IF(ISBLANK(AnalysesComparatives!#REF!),\"\",SUBSTITUTE(AnalysesComparatives!#REF!,\"<\",\"\")*1)","v":{"$error":"#REF!"}},{"$error":"#REF!"},{"$f":"IF(L57=\"\",\"\",IF(L57=\"-\",\"oui\",IF(OR(AND(AVERAGE(J57:K57)>Metauxfaible,ABS(L57)>3*EMT_Metaux_forte),AND(AVERAGE(J57:K57)<Metauxfaible,ABS(L57)>3*EMT_Metaux_faible)),\"non\",IF(AND(J57<=SC_Metaux,K57<=SC_Metaux),\"oui\",IF(AND(AVERAGE(J57:K57)>Metauxfaible,L57>=-EMT_Metaux_forte,L57<=EMT_Metaux_forte),\"oui\",IF(AND(AVERAGE(J57:K57)<=Metauxfaible,L57>=-EMT_Metaux_faible,L57<=EMT_Metaux_faible),\"oui\",\"non\"))))))","v":{"$error":"#REF!"}}]
["Autres métaux",{"$f":"IF(ISBLANK(AnalysesComparatives!#REF!),\"\",SUBSTITUTE(AnalysesComparatives!#REF!,\"<\",\"\")*1)","v":{"$error":"#REF!"}},{"$f":"IF(ISBLANK(AnalysesComparatives!#REF!),\"\",SUBSTITUTE(AnalysesComparatives!#REF!,\"<\",\"\")*1)","v":{"$error":"#REF!"}},{"$error":"#REF!"},{"$f":"IF(D58=\"\",\"\",IF(D58=\"-\",\"oui\",IF(OR(AND(AVERAGE(B58:C58)>Metauxfaible,ABS(D58)>3*EMT_Metaux_forte),AND(AVERAGE(B58:C58)<Metauxfaible,ABS(D58)>3*EMT_Metaux_faible)),\"non\",IF(AND(B58<=SC_Metaux,C58<=SC_Metaux),\"oui\",IF(AND(AVERAGE(B58:C58)>Metauxfaible,D58>=-EMT_Metaux_forte,D58<=EMT_Metaux_forte),\"oui\",IF(AND(AVERAGE(B58:C58)<=Metauxfaible,D58>=-EMT_Metaux_faible,D58<=EMT_Metaux_faible),\"oui\",\"non\"))))))","v":{"$error":"#REF!"}},{"$f":"IF(ISBLANK(AnalysesComparatives!#REF!),\"\",SUBSTITUTE(AnalysesComparatives!#REF!,\"<\",\"\")*1)","v":{"$error":"#REF!"}},{"$f":"IF(ISBLANK(AnalysesComparatives!#REF!),\"\",SUBSTITUTE(AnalysesComparatives!#REF!,\"<\",\"\")*1)","v":{"$error":"#REF!"}},{"$error":"#REF!"},{"$f":"IF(H58=\"\",\"\",IF(H58=\"-\",\"oui\",IF(OR(AND(AVERAGE(F58:G58)>Metauxfaible,ABS(H58)>3*EMT_Metaux_forte),AND(AVERAGE(F58:G58)<Metauxfaible,ABS(H58)>3*EMT_Metaux_faible)),\"non\",IF(AND(F58<=SC_Metaux,G58<=SC_Metaux),\"oui\",IF(AND(AVERAGE(F58:G58)>Metauxfaible,H58>=-EMT_Metaux_forte,H58<=EMT_Metaux_forte),\"oui\",IF(AND(AVERAGE(F58:G58)<=Metauxfaible,H58>=-EMT_Metaux_faible,H58<=EMT_Metaux_faible),\"oui\",\"non\"))))))","v":{"$error":"#REF!"}},{"$f":"IF(ISBLANK(AnalysesComparatives!#REF!),\"\",SUBSTITUTE(AnalysesComparatives!#REF!,\"<\",\"\")*1)","v":{"$error":"#REF!"}},{"$f":"IF(ISBLANK(AnalysesComparatives!#REF!),\"\",SUBSTITUTE(AnalysesComparatives!#REF!,\"<\",\"\")*1)","v":{"$error":"#REF!"}},{"$error":"#REF!"},{"$f":"IF(L58=\"\",\"\",IF(L58=\"-\",\"oui\",IF(OR(AND(AVERAGE(J58:K58)>Metauxfaible,ABS(L58)>3*EMT_Metaux_forte),AND(AVERAGE(J58:K58)<Metauxfaible,ABS(L58)>3*EMT_Metaux_faible)),\"non\",IF(AND(J58<=SC_Metaux,K58<=SC_Metaux),\"oui\",IF(AND(AVERAGE(J58:K58)>Metauxfaible,L58>=-EMT_Metaux_forte,L58<=EMT_Metaux_forte),\"oui\",IF(AND(AVERAGE(J58:K58)<=Metauxfaible,L58>=-EMT_Metaux_faible,L58<=EMT_Metaux_faible),\"oui\",\"non\"))))))","v":{"$error":"#REF!"}}]
["CN",{"$f":"IF(ISBLANK(AnalysesComparatives!#REF!),\"\",SUBSTITUTE(AnalysesComparatives!#REF!,\"<\",\"\")*1)","v":{"$error":"#REF!"}},{"$f":"IF(ISBLANK(AnalysesComparatives!#REF!),\"\",SUBSTITUTE(AnalysesComparatives!#REF!,\"<\",\"\")*1)","v":{"$error":"#REF!"}},{"$f":"IF(OR(C59=\"\",B59=\"\"),\"\",IF(AND(B59<=SC_CN,C59<=SC_CN),\"-\",(B59-AVERAGE(B59:C59))/AVERAGE(B59:C59)))","v":{"$error":"#REF!"}},{"$f":"IF(D59=\"\",\"\",IF(D59=\"-\",\"oui\",IF(OR(AND(AVERAGE(B59:C59)>CNfaible,ABS(D59)>3*EMT_CN_forte),AND(AVERAGE(B59:C59)<CNfaible,ABS(D59)>3*EMT_CN_faible)),\"non\",IF(AND(B59<=SC_CN,C59<=SC_CN),\"oui\",IF(AND(AVERAGE(B59:C59)>CNfaible,D59>=-EMT_CN_forte,D59<=EMT_CN_forte),\"oui\",IF(AND(AVERAGE(B59:C59)<=CNfaible,D59>=-EMT_CN_faible,D59<=EMT_CN_faible),\"oui\",\"non\"))))))","v":{"$error":"#REF!"}},{"$f":"IF(ISBLANK(AnalysesComparatives!#REF!),\"\",SUBSTITUTE(AnalysesComparatives!#REF!,\"<\",\"\")*1)","v":{"$error":"#REF!"}},{"$f":"IF(ISBLANK(AnalysesComparatives!#REF!),\"\",SUBSTITUTE(AnalysesComparatives!#REF!,\"<\",\"\")*1)","v":{"$error":"#REF!"}},{"$f":"IF(OR(G59=\"\",F59=\"\"),\"\",IF(AND(F59<=SC_CN,G59<=SC_CN),\"-\",(F59-AVERAGE(F59:G59))/AVERAGE(F59:G59)))","v":{"$error":"#REF!"}},{"$f":"IF(H59=\"\",\"\",IF(H59=\"-\",\"oui\",IF(OR(AND(AVERAGE(F59:G59)>CNfaible,ABS(H59)>3*EMT_CN_forte),AND(AVERAGE(F59:G59)<CNfaible,ABS(H59)>3*EMT_CN_faible)),\"non\",IF(AND(F59<=SC_CN,G59<=SC_CN),\"oui\",IF(AND(AVERAGE(F59:G59)>CNfaible,H59>=-EMT_CN_forte,H59<=EMT_CN_forte),\"oui\",IF(AND(AVERAGE(F59:G59)<=CNfaible,H59>=-EMT_CN_faible,H59<=EMT_CN_faible),\"oui\",\"non\"))))))","v":{"$error":"#REF!"}},{"$f":"IF(ISBLANK(AnalysesComparatives!#REF!),\"\",SUBSTITUTE(AnalysesComparatives!#REF!,\"<\",\"\")*1)","v":{"$error":"#REF!"}},{"$f":"IF(ISBLANK(AnalysesComparatives!#REF!),\"\",SUBSTITUTE(AnalysesComparatives!#REF!,\"<\",\"\")*1)","v":{"$error":"#REF!"}},{"$f":"IF(OR(K59=\"\",J59=\"\"),\"\",IF(AND(J59<=SC_CN,K59<=SC_CN),\"-\",(J59-AVERAGE(J59:K59))/AVERAGE(J59:K59)))","v":{"$error":"#REF!"}},{"$f":"IF(L59=\"\",\"\",IF(L59=\"-\",\"oui\",IF(OR(AND(AVERAGE(J59:K59)>CNfaible,ABS(L59)>3*EMT_CN_forte),AND(AVERAGE(J59:K59)<CNfaible,ABS(L59)>3*EMT_CN_faible)),\"non\",IF(AND(J59<=SC_CN,K59<=SC_CN),\"oui\",IF(AND(AVERAGE(J59:K59)>CNfaible,L59>=-EMT_CN_forte,L59<=EMT_CN_forte),\"oui\",IF(AND(AVERAGE(J59:K59)<=CNfaible,L59>=-EMT_CN_faible,L59<=EMT_CN_faible),\"oui\",\"non\"))))))","v":{"$error":"#REF!"}}]
["AOX",{"$f":"IF(ISBLANK(AnalysesComparatives!#REF!),\"\",SUBSTITUTE(AnalysesComparatives!#REF!,\"<\",\"\")*1)","v":{"$error":"#REF!"}},{"$f":"IF(ISBLANK(AnalysesComparatives!#REF!),\"\",SUBSTITUTE(AnalysesComparatives!#REF!,\"<\",\"\")*1)","v":{"$error":"#REF!"}},{"$f":"IF(OR(C60=\"\",B60=\"\"),\"\",IF(AND(B60<=SC_AOX,C60<=SC_AOX),\"-\",(B60-AVERAGE(B60:C60))/AVERAGE(B60:C60)))","v":{"$error":"#REF!"}},{"$f":"IF(D60=\"\",\"\",IF(D60=\"-\",\"oui\",IF(OR(AND(AVERAGE(B60:C60)>AOXfaible,ABS(D60)>3*EMT_AOX_forte),AND(AVERAGE(B60:C60)<AOXfaible,ABS(D60)>3*EMT_AOX_faible)),\"non\",IF(AND(B60<=SC_AOX,C60<=SC_AOX),\"oui\",IF(AND(AVERAGE(B60:C60)>AOXfaible,D60>=-EMT_AOX_forte,D60<=EMT_AOX_forte),\"oui\",IF(AND(AVERAGE(B60:C60)<=AOXfaible,D60>=-EMT_AOX_faible,D60<=EMT_AOX_faible),\"oui\",\"non\"))))))","v":{"$error":"#REF!"}},{"$f":"IF(ISBLANK(AnalysesComparatives!#REF!),\"\",SUBSTITUTE(AnalysesComparatives!#REF!,\"<\",\"\")*1)","v":{"$error":"#REF!"}},{"$f":"IF(ISBLANK(AnalysesComparatives!#REF!),\"\",SUBSTITUTE(AnalysesComparatives!#REF!,\"<\",\"\")*1)","v":{"$error":"#REF!"}},{"$f":"IF(OR(G60=\"\",F60=\"\"),\"\",IF(AND(F60<=SC_AOX,G60<=SC_AOX),\"-\",(F60-AVERAGE(F60:G60))/AVERAGE(F60:G60)))","v":{"$error":"#REF!"}},{"$f":"IF(H60=\"\",\"\",IF(H60=\"-\",\"oui\",IF(OR(AND(AVERAGE(F60:G60)>AOXfaible,ABS(H60)>3*EMT_AOX_forte),AND(AVERAGE(F60:G60)<AOXfaible,ABS(H60)>3*EMT_AOX_faible)),\"non\",IF(AND(F60<=SC_AOX,G60<=SC_AOX),\"oui\",IF(AND(AVERAGE(F60:G60)>AOXfaible,H60>=-EMT_AOX_forte,H60<=EMT_AOX_forte),\"oui\",IF(AND(AVERAGE(F60:G60)<=AOXfaible,H60>=-EMT_AOX_faible,H60<=EMT_AOX_faible),\"oui\",\"non\"))))))","v":{"$error":"#REF!"}},{"$f":"IF(ISBLANK(AnalysesComparatives!#REF!),\"\",SUBSTITUTE(AnalysesComparatives!#REF!,\"<\",\"\")*1)","v":{"$error":"#REF!"}},{"$f":"IF(ISBLANK(AnalysesComparatives!#REF!),\"\",SUBSTITUTE(AnalysesComparatives!#REF!,\"<\",\"\")*1)","v":{"$error":"#REF!"}},{"$f":"IF(OR(K60=\"\",J60=\"\"),\"\",IF(AND(J60<=SC_AOX,K60<=SC_AOX),\"-\",(J60-AVERAGE(J60:K60))/AVERAGE(J60:K60)))","v":{"$error":"#REF!"}},{"$f":"IF(L60=\"\",\"\",IF(L60=\"-\",\"oui\",IF(OR(AND(AVERAGE(J60:K60)>AOXfaible,ABS(L60)>3*EMT_AOX_forte),AND(AVERAGE(J60:K60)<AOXfaible,ABS(L60)>3*EMT_AOX_faible)),\"non\",IF(AND(J60<=SC_AOX,K60<=SC_AOX),\"oui\",IF(AND(AVERAGE(J60:K60)>AOXfaible,L60>=-EMT_AOX_forte,L60<=EMT_AOX_forte),\"oui\",IF(AND(AVERAGE(J60:K60)<=AOXfaible,L60>=-EMT_AOX_faible,L60<=EMT_AOX_faible),\"oui\",\"non\"))))))","v":{"$error":"#REF!"}}]
["COT",{"$f":"IF(ISBLANK(AnalysesComparatives!#REF!),\"\",SUBSTITUTE(AnalysesComparatives!#REF!,\"<\",\"\")*1)","v":{"$error":"#REF!"}},{"$f":"IF(ISBLANK(AnalysesComparatives!#REF!),\"\",SUBSTITUTE(AnalysesComparatives!#REF!,\"<\",\"\")*1)","v":{"$error":"#REF!"}},{"$f":"IF(OR(C61=\"\",B61=\"\"),\"\",IF(AND(B61<=SC_COT,C61<=SC_COT),\"-\",(B61-AVERAGE(B61:C61))/AVERAGE(B61:C61)))","v":{"$error":"#REF!"}},{"$f":"IF(D61=\"\",\"\",IF(D61=\"-\",\"oui\",IF(OR(AND(AVERAGE(B61:C61)>COTfaible,ABS(D61)>3*EMT_COT_forte),AND(AVERAGE(B61:C61)<COTfaible,ABS(D61)>3*EMT_COT_faible)),\"non\",IF(AND(B61<=SC_COT,C61<=SC_COT),\"oui\",IF(AND(AVERAGE(B61:C61)>COTfaible,D61>=-EMT_COT_forte,D61<=EMT_COT_forte),\"oui\",IF(AND(AVERAGE(B61:C61)<=COTfaible,D61>=-EMT_COT_faible,D61<=EMT_COT_faible),\"oui\",\"non\"))))))","v":{"$error":"#REF!"}},{"$f":"IF(ISBLANK(AnalysesComparatives!#REF!),\"\",SUBSTITUTE(AnalysesComparatives!#REF!,\"<\",\"\")*1)","v":{"$error":"#REF!"}},{"$f":"IF(ISBLANK(AnalysesComparatives!#REF!),\"\",SUBSTITUTE(AnalysesComparatives!#REF!,\"<\",\"\")*1)","v":{"$error":"#REF!"}},{"$f":"IF(OR(G61=\"\",F61=\"\"),\"\",IF(AND(F61<=SC_COT,G61<=SC_COT),\"-\",(F61-AVERAGE(F61:G61))/AVERAGE(F61:G61)))","v":{"$error":"#REF!"}},{"$f":"IF(H61=\"\",\"\",IF(H61=\"-\",\"oui\",IF(OR(AND(AVERAGE(F61:G61)>COTfaible,ABS(H61)>3*EMT_COT_forte),AND(AVERAGE(F61:G61)<COTfaible,ABS(H61)>3*EMT_COT_faible)),\"non\",IF(AND(F61<=SC_COT,G61<=SC_COT),\"oui\",IF(AND(AVERAGE(F61:G61)>COTfaible,H61>=-EMT_COT_forte,H61<=EMT_COT_forte),\"oui\",IF(AND(AVERAGE(F61:G61)<=COTfaible,H61>=-EMT_COT_faible,H61<=EMT_COT_faible),\"oui\",\"non\"))))))","v":{"$error":"#REF!"}},{"$f":"IF(ISBLANK(AnalysesComparatives!#REF!),\"\",SUBSTITUTE(AnalysesComparatives!#REF!,\"<\",\"\")*1)","v":{"$error":"#REF!"}},{"$f":"IF(ISBLANK(AnalysesComparatives!#REF!),\"\",SUBSTITUTE(AnalysesComparatives!#REF!,\"<\",\"\")*1)","v":{"$error":"#REF!"}},{"$f":"IF(OR(K61=\"\",J61=\"\"),\"\",IF(AND(J61<=SC_COT,K61<=SC_COT),\"-\",(J61-AVERAGE(J61:K61))/AVERAGE(J61:K61)))","v":{"$error":"#REF!"}},{"$f":"IF(L61=\"\",\"\",IF(L61=\"-\",\"oui\",IF(OR(AND(AVERAGE(J61:K61)>COTfaible,ABS(L61)>3*EMT_COT_forte),AND(AVERAGE(J61:K61)<COTfaible,ABS(L61)>3*EMT_COT_faible)),\"non\",IF(AND(J61<=SC_COT,K61<=SC_COT),\"oui\",IF(AND(AVERAGE(J61:K61)>COTfaible,L61>=-EMT_COT_forte,L61<=EMT_COT_forte),\"oui\",IF(AND(AVERAGE(J61:K61)<=COTfaible,L61>=-EMT_COT_faible,L61<=EMT_COT_faible),\"oui\",\"non\"))))))","v":{"$error":"#REF!"}}]
["Mi",{"$f":"IF(ISBLANK(AnalysesComparatives!#REF!),\"\",SUBSTITUTE(AnalysesComparatives!#REF!,\"<\",\"\")*1)","v":{"$error":"#REF!"}},{"$f":"IF(ISBLANK(AnalysesComparatives!#REF!),\"\",SUBSTITUTE(AnalysesComparatives!#REF!,\"<\",\"\")*1)","v":{"$error":"#REF!"}},{"$f":"IF(OR(C62=\"\",B62=\"\"),\"\",IF(AND(B62<=SC_Mi,C62<=SC_Mi),\"-\",(B62-AVERAGE(B62:C62))/AVERAGE(B62:C62)))","v":{"$error":"#REF!"}},{"$f":"IF(D62=\"\",\"\",IF(D62=\"-\",\"oui\",IF(OR(AND(AVERAGE(B62:C62)>Mifaible,ABS(D62)>3*EMT_Mi_forte),AND(AVERAGE(B62:C62)<Mifaible,ABS(D62)>3*EMT_Mi_faible)),\"non\",IF(AND(B62<=SC_Mi,C62<=SC_Mi),\"oui\",IF(AND(AVERAGE(B62:C62)>Mifaible,D62>=-EMT_Mi_forte,D62<=EMT_Mi_forte),\"oui\",IF(AND(AVERAGE(B62:C62)<=Mifaible,D62>=-EMT_Mi_faible,D62<=EMT_Mi_faible),\"oui\",\"non\"))))))","v":{"$error":"#REF!"}},{"$f":"IF(ISBLANK(AnalysesComparatives!#REF!),\"\",SUBSTITUTE(AnalysesComparatives!#REF!,\"<\",\"\")*1)","v":{"$error":"#REF!"}},{"$f":"IF(ISBLANK(AnalysesComparatives!#REF!),\"\",SUBSTITUTE(AnalysesComparatives!#REF!,\"<\",\"\")*1)","v":{"$error":"#REF!"}},{"$f":"IF(OR(G62=\"\",F62=\"\"),\"\",IF(AND(F62<=SC_Mi,G62<=SC_Mi),\"-\",(F62-AVERAGE(F62:G62))/AVERAGE(F62:G62)))","v":{"$error":"#REF!"}},{"$f":"IF(H62=\"\",\"\",IF(H62=\"-\",\"oui\",IF(OR(AND(AVERAGE(F62:G62)>Mifaible,ABS(H62)>3*EMT_Mi_forte),AND(AVERAGE(F62:G62)<Mifaible,ABS(H62)>3*EMT_Mi_faible)),\"non\",IF(AND(F62<=SC_Mi,G62<=SC_Mi),\"oui\",IF(AND(AVERAGE(F62:G62)>Mifaible,H62>=-EMT_Mi_forte,H62<=EMT_Mi_forte),\"oui\",IF(AND(AVERAGE(F62:G62)<=Mifaible,H62>=-EMT_Mi_faible,H62<=EMT_Mi_faible),\"oui\",\"non\"))))))","v":{"$error":"#REF!"}},{"$f":"IF(ISBLANK(AnalysesComparatives!#REF!),\"\",SUBSTITUTE(AnalysesComparatives!#REF!,\"<\",\"\")*1)","v":{"$error":"#REF!"}},{"$f":"IF(ISBLANK(AnalysesComparatives!#REF!),\"\",SUBSTITUTE(AnalysesComparatives!#REF!,\"<\",\"\")*1)","v":{"$error":"#REF!"}},{"$f":"IF(OR(K62=\"\",J62=\"\"),\"\",IF(AND(J62<=SC_Mi,K62<=SC_Mi),\"-\",(J62-AVERAGE(J62:K62))/AVERAGE(J62:K62)))","v":{"$error":"#REF!"}},{"$f":"IF(L62=\"\",\"\",IF(L62=\"-\",\"oui\",IF(OR(AND(AVERAGE(J62:K62)>Mifaible,ABS(L62)>3*EMT_Mi_forte),AND(AVERAGE(J62:K62)<Mifaible,ABS(L62)>3*EMT_Mi_faible)),\"non\",IF(AND(J62<=SC_Mi,K62<=SC_Mi),\"oui\",IF(AND(AVERAGE(J62:K62)>Mifaible,L62>=-EMT_Mi_forte,L62<=EMT_Mi_forte),\"oui\",IF(AND(AVERAGE(J62:K62)<=Mifaible,L62>=-EMT_Mi_faible,L62<=EMT_Mi_faible),\"oui\",\"non\"))))))","v":{"$error":"#REF!"}}]
["autre para.",{"$f":"IF(ISBLANK(AnalysesComparatives!#REF!),\"\",SUBSTITUTE(AnalysesComparatives!#REF!,\"<\",\"\")*1)","v":{"$error":"#REF!"}},{"$f":"IF(ISBLANK(AnalysesComparatives!#REF!),\"\",SUBSTITUTE(AnalysesComparatives!#REF!,\"<\",\"\")*1)","v":{"$error":"#REF!"}},{"$f":"IF(AND(C63<>\"\",B63<>\"\"),((B63-AVERAGE(B63:C63))/AVERAGE(B63:C63)),\"\")","v":{"$error":"#REF!"}},{"$f":"IF(D63=\"\",\"\",IF(D63=\"-\",\"oui\",IF(OR(AND(AVERAGE(B63:C63)>COTfaible,ABS(D63)>3*EMT_COT_forte),AND(AVERAGE(B63:C63)<COTfaible,ABS(D63)>3*EMT_COT_faible)),\"non\",IF(AND(B63<=SC_COT,C63<=SC_COT),\"oui\",IF(AND(AVERAGE(B63:C63)>COTfaible,D63>=-EMT_COT_forte,D63<=EMT_COT_forte),\"oui\",IF(AND(AVERAGE(B63:C63)<=COTfaible,D63>=-EMT_COT_faible,D63<=EMT_COT_faible),\"oui\",\"non\"))))))","v":{"$error":"#REF!"}},{"$f":"IF(ISBLANK(AnalysesComparatives!#REF!),\"\",SUBSTITUTE(AnalysesComparatives!#REF!,\"<\",\"\")*1)","v":{"$error":"#REF!"}},{"$f":"IF(ISBLANK(AnalysesComparatives!#REF!),\"\",SUBSTITUTE(AnalysesComparatives!#REF!,\"<\",\"\")*1)","v":{"$error":"#REF!"}},{"$f":"IF(AND(G63<>\"\",F63<>\"\"),((F63-AVERAGE(F63:G63))/AVERAGE(F63:G63)),\"\")","v":{"$error":"#REF!"}},{"$f":"IF(H63=\"\",\"\",IF(H63=\"-\",\"oui\",IF(OR(AND(AVERAGE(F63:G63)>COTfaible,ABS(H63)>3*EMT_COT_forte),AND(AVERAGE(F63:G63)<COTfaible,ABS(H63)>3*EMT_COT_faible)),\"non\",IF(AND(F63<=SC_COT,G63<=SC_COT),\"oui\",IF(AND(AVERAGE(F63:G63)>COTfaible,H63>=-EMT_COT_forte,H63<=EMT_COT_forte),\"oui\",IF(AND(AVERAGE(F63:G63)<=COTfaible,H63>=-EMT_COT_faible,H63<=EMT_COT_faible),\"oui\",\"non\"))))))","v":{"$error":"#REF!"}},{"$f":"IF(ISBLANK(AnalysesComparatives!#REF!),\"\",SUBSTITUTE(AnalysesComparatives!#REF!,\"<\",\"\")*1)","v":{"$error":"#REF!"}},{"$f":"IF(ISBLANK(AnalysesComparatives!#REF!),\"\",SUBSTITUTE(AnalysesComparatives!#REF!,\"<\",\"\")*1)","v":{"$error":"#REF!"}},{"$f":"IF(AND(K63<>\"\",J63<>\"\"),((J63-AVERAGE(J63:K63))/AVERAGE(J63:K63)),\"\")","v":{"$error":"#REF!"}},{"$f":"IF(L63=\"\",\"\",IF(L63=\"-\",\"oui\",IF(OR(AND(AVERAGE(J63:K63)>COTfaible,ABS(L63)>3*EMT_COT_forte),AND(AVERAGE(J63:K63)<COTfaible,ABS(L63)>3*EMT_COT_faible)),\"non\",IF(AND(J63<=SC_COT,K63<=SC_COT),\"oui\",IF(AND(AVERAGE(J63:K63)>COTfaible,L63>=-EMT_COT_forte,L63<=EMT_COT_forte),\"oui\",IF(AND(AVERAGE(J63:K63)<=COTfaible,L63>=-EMT_COT_faible,L63<=EMT_COT_faible),\"oui\",\"non\"))))))","v":{"$error":"#REF!"}}]

{"sheet":"ZonesNommées","index":5,"n_rows":65,"n_cols":10,"rows_kept":65,"cut":false,"hidden":true,"merged":[[0,1,0,2]]}
[null,"Zones nommées",null,null,"IndexStation","Type Point","Intervenants","Laboratoires","Paramètres","SRR"]
[null,"SC DBO5",15,{"$f":"SynthèseContrôle!D6","v":0},{"$f":"MATCH(SynthèseContrôle!D6,RéférenceCDA!A2:A1945)","v":{"$error":"#N/A"}},"Entrée station","Agence de l'Eau RM&C","APAVE SUD","AOX","X"]
[null,"DBO5faible",80,null,null,"Sortie station","CETE Apave Sud Europe - Marseille","CAR ILLKIRCH","MI"]
[null,"EMT DBO5 faible",0.3,null,null,"Eaux refroidi-ssement","CETE Apave Sud Europe - Tassin","SEM","TEMPERATURE"]
[null,"EMT DBO5 forte",0.2,null,null,"Sortie prétraitement","APAVE Alsacienne","LSEH"]
[null,"SC DCO",80,null,null,"Rejet général","CEREG Ingéniérie","LSEH MI"]
[null,"DCOfaible",250,null,null,"Rejet usine","CTC","SEM MI"]
[null,"EMT DCO faible",0.2,null,null,"Entrée tampon","JCM Environnement","APAVE SUD & SEM MI"]
[null,"EMT DCO forte",0.1,null,null,"Sortie tampon","IRH Ingénieur Conseil","SEM & SEM MI"]
[null,"SC ST-DCO",20,null,null,"By-pass","NORISKO Equipements - Vitrolles","LSEH & LSEH MI"]
[null,"ST-DCOfaible",150,null,null,"Déversoir","SATESE - Office d'Equipement Hydraulique de la Corse","CAR ILLKIRCH & LSEH MI"]
[null,"EMT ST-DCO faible",0.2,null,null,"Eau alimentation","SGS - Vaulx en Velin","LDVH DE LA HAUTE SAONE"]
[null,"EMT ST-DCO forte",0.1,null,null,"Sortie biologique","SOCOTEC Industries"]
[null,"SC MEST",15,null,null,"Sortie physico","SATESE - Conseil Départemental des Alpes Maritimes"]
[null,"MESTfaible",60,null,null,"Boues aérées","SATESE - Conseil Départemental de la Savoie"]
[null,"EMT MEST faible",0.3,null,null,"Boues déshydratées","SATESE - Conseil Général de l'Hérault"]
[null,"EMT MEST forte",0.2,null,null,null,"SATESE - Agence Régionale pour l'Environnement"]
[null,"SC Nk",6,null,null,null,"SATESE - Conseil Départemental des Vosges"]
[null,"Nkfaible",6]
[null,"EMT Nk faible",0.1]
[null,"EMT Nk forte",0.1]
[null,"SC NH4",6]
[null,"NH4faible",6]
[null,"EMT NH4 faible",0.1]
[null,"EMT NH4 forte",0.1]
[null,"SC NO2",1]
[null,"NO2faible",1]
[null,"EMT NO2 faible",0.2]
[null,"EMT NO2 forte",0.2]
[null,"SC NO3",5]
[null,"NO3faible",5]
[null,"EMT NO3 faible",0.2]
[null,"EMT NO3 forte",0.2]
[null,"SC NGL",6]
[null,"NGfaible",6]
[null,"EMT NGL faible",0.2]
[null,"EMT NGL forte",0.2]
[null,"SC Pt",1]
[null,"Ptfaible",1]
[null,"EMT Pt faible",0.2]
[null,"EMT Pt forte",0.2]
[null,"SC Hg",5.0000000000000001E-3]
[null,"Hgfaible",0.01]
[null,"EMT Hg faible",0.6]
[null,"EMT Hg forte",0.3]
[null,"SC Metaux",0.5]
[null,"Metauxfaible",1]
[null,"EMT Metaux faible",0.6]
[null,"EMT Metaux forte",0.3]
[null,"SC AOX",0.05]
[null,"AOXfaible",0.5]
[null,"EMT AOX faible",0.6]
[null,"EMT AOX forte",0.3]
[null,"SC COT",5]
[null,"COTfaible",10]
[null,"EMT COT faible",0.3]
[null,"EMT COT forte",0.1]
[null,"SC CN",0.5]
[null,"CNfaible",1]
[null,"EMT CN faible",0.6]
[null,"EMT CN forte",0.3]
[null,"SC Mi",1]
[null,"Mifaible",3]
[null,"EMT Mi faible",0.3]
[null,"EMT Mi forte",0.2]

{"sheet":"SeuilsComparaison-EMT","index":6,"n_rows":26,"n_cols":10,"rows_kept":26,"cut":false,"hidden":false,"merged":[[34,3,44,8],[1,1,1,9],[25,1,26,9]]}
[]
[null," COMPARATIF ANALYTIQUE : DEFINITION DES ECARTS MAXIMUM TOLERES (EMT)"]
[]
[null,"Code SANDRE","Paramètres","Unités","Limites de quantification","Seuil de comparaison","Concentration supérieure au seuil de comparaison et   inférieure ou égale à","Ecart Maximum Toléré","Concentration supérieure à","Ecart Maximum Toléré"]
[null,1313,"DBO5","en mg/l de O2",3,15,80,0.3,80,0.2]
[null,1314,"DCO","en mg/l de O2",30,80,250,0.2,250,0.1]
[null,6396,"ST DCO","en mg/l de O2",10,20,150,0.2,150,0.1]
[null,1305,"MEST","en mg/l",2,15,60,0.3,60,0.2]
[null,1319,"NKJ (N)","en mg/l de N",0.5,6,null,null,6,0.1]
[null,1551,"NGL","en mg/l de N",1,6,null,null,6,0.2]
[null,1335,"NH4 (NH4)","en mg/l de NH4+",0.5,6,null,null,6,0.1]
[null,1339,"NO2 (NO2)","en mg/l de NO2",0.05,1,null,null,1,0.2]
[null,1340,"NO3 (NO3)","en mg/l de NO3",1,5,null,null,5,0.2]
[null,1350,"PT","en mg/l de P",0.05,1,null,null,1,0.2]
[null,1369,"As","en mg/l",5.0000000000000001E-3,0.5,1,0.6,1,0.3]
[null,1388,"Cd","en mg/l",1E-3,0.5,1,0.6,1,0.3]
[null,1389,"Cr","en mg/l",5.0000000000000001E-3,0.5,1,0.6,1,0.3]
[null,1392,"Cu","en mg/l",5.0000000000000001E-3,0.5,1,0.6,1,0.3]
[null,1387,"Hg","en mg/l",2.0000000000000001E-4,5.0000000000000001E-3,0.01,0.6,0.01,0.3]
[null,1386,"Ni","en mg/l",5.0000000000000001E-3,0.5,1,0.6,1,0.3]
[null,1382,"Pb","en mg/l",2E-3,0.5,1,0.6,1,0.3]
[null,1383,"Zn","en mg/l",5.0000000000000001E-3,0.5,1,0.6,1,0.3]
[null,1106,"AOX","en mg/l",0.01,0.05,0.5,0.6,0.5,0.3]
[null,1841,"COT","en mg/l",0.3,5,15,0.3,15,0.1]
[]
[null,"Le cacul des écarts analytiques est effectué si l'un des deux ou les deux résultats sont au dessus du seuil de comparaison. L'écart est calculé par rapport à la moyenne des 2 valeurs."]

{"sheet":"LimitequantificationSDE","index":7,"n_rows":20,"n_cols":5,"rows_kept":20,"cut":false,"hidden":false,"merged":[[1,1,1,4]]}
[]
[null," LIMITES DE QUANTIFICATION POUR LES SDE"]
[]
[null,"Code SANDRE","Paramètres","Limites de quantification","Coefficient multiplicateur de la masse rejetée"]
[null,1458,"Anthracène","0,010 µg/l",100]
[null,1114,"Benzène","1,0 µg/l",10]
[null,1115,"Benzo(a)pyrène","0,010 µg/l",100]
[null,1116,"Benzo(b)fluoranthène","0,005 µg/l",100]
[null,1117,"Benzo(k)fluoranthène","0,005 µg/l",100]
[null,1118,"Benzo(ghi)pérylène","0,005 µg/l",1000]
[null,6616,"Di(2-éthylhexyl)phtalate DEHP","1,0 µg/l",10]
[null,1497,"Ethylbenzène","1,0 µg/l",10]
[null,1191,"Fluoranthène","0,010 µg/l",100]
[null,1204,"Indeno(1,2,3-cd)pyrène","0,005 µg/l",1000]
[null,1517,"Naphtalène","0,050 µg/l",10]
[null,6598,"Nonylphénols mélange","0,5 µg/l",50]
[null,6600,"p-Octylphénol melange","0,5 µg/l",100]
[null,1278,"Toluène","1 µg/l",10]
[null,2879,"Tributylétain cation","0,02 µg/l",1000]
[null,1780,"Xylènes","2 µg/l",10]

{"sheet":"ModeOpératoire","index":8,"n_rows":35,"n_cols":1,"rows_kept":35,"cut":false,"hidden":false,"merged":[]}
["Mode opératoire d’utilisation de la fiche de cotation du fonctionnement du dispositif de suivi régulier des rejets et de mesure de la pollution évitée"]
[]
[]
["Onglet  cotation dispositif :"]
["Pour les rubriques \"Mesure de débit et Prélèvement\", l’évaluation de chaque critère s’effectue par un double « clic » sur la case oui ou non, tous les critères doivent être évalués,"]
["Pour la mesure de débit en écoulement en charge, le bon fonctionnement sera évalué à partir d’une mesure comparative et (si écart entre 5 et 10%) / ou (si impossibilité d'une mesure) à partir des 3 méthodes alternatives."]
[]
["Onglet  analyses comparatives :"]
["Evaluer la qualité du traitement des échantillons : choisir « oui » ou « non », sur les bases des critères d’évaluations présentés,"]
["Renseigner pour chaque paramètre analytique considéré, les cases correspondantes aux résultats d’analyses produits par le laboratoire de l’établissement et le(s) laboratoire(s) de contrôle,"]
["Identifier en jaune les résultats d'analyses produits par le laboratoire de l'établissement interne."]
["Identifier en italique les résultats d'analyses produits sous accréditation ou agrément"]
[]
["Méthode de calcul des écarts : mesure de débit ou analyses"]
["Soit a, le résultat de mesure ou d’analyse produit par  l'établissement"]
["Soit b, le résultat de la mesure ou d’analyse produit par l’organisme et le laboratoire de contrôle,"]
["Soit c = (a + b) / 2 = la moyenne arithmétique des 2 résultats,"]
["Ecart(%) = ((a-c)/c)x100"]
["Le calcul des écarts analytiques est effectué si :"]
["l'un des deux ou les deux résultats sont au-dessus du seuil de comparaison,"]
["Dans tous les autres cas, le calcul n’est pas effectué (affichage du symbole -)."]
[]
["Résultats de l'état comparatif analytique :"]
["L'écart est inférieur ou égal à l'écart maximum toléré ou n’a pas été calculé (affichage du symbole -.), le résultat d'analyse est conforme, se traduisant par \"Oui\","]
["L'écart est supérieur à l'écart maximum toléré, le résultat d'analyse est non conforme, se traduisant par \"Non\","]
["Lorsque les deux résultats sont rendus COFRAC, l'analyse est considére conforme (\"Oui\"), quelque soit l'écart mesuré."]
[]
["Synthèse du diagnostic (page de garde) :"]
["Sur la page de garde de la fiche, seront reprises automatiquement les cotations attribuées pour les rubriques mesure de débit, prélèvement et analyses,"]
["La performance du système qualité sera évaluée : choisir oui ou non,"]
["La cotation attribuée au dispositif sera alors égale à la moyenne arithmétique des 3 cotations des "]
["rubriques mesure de débit, prélèvement et analyses, réduite de 10% si le système qualité n’est pas performant."]
["Si la cotation globale est supérieure ou égale à 8, le dispositif  bénéficiera d’un avis favorable, pouvant conduire à son agrément ou à sa validation,"]
["Si la cotation globale est comprise entre 7 et 8, le dispositif devra faire l’objet d’actions d’amélioration pour l’obtention de son agrément ou de sa validation,"]
["Si la cotation globale est inférieure à 7, ou qu'une des notes est inférieure à 6, le dispositif  ne sera pas validé."]